Benzyl alcohol, TMS derivative
- Formula: C10H16OSi
- Molecular weight: 180.3189
- IUPAC Standard InChIKey: AOKMFXQCRBQJOP-UHFFFAOYSA-N
- CAS Registry Number: 14642-79-6
- Chemical structure:
View 3d structure (requires JavaScript / HTML 5) - Other names: Silane, trimethyl(phenylmethoxy)-; Silane, (benzyloxy)trimethyl-; (Benzyloxy)trimethylsilane; Benzyl alcohol, TMS; Benzyl alcohol, trimethylsilyl ether

Van Den Dool and Kratz RI, non-polar column, temperature ramp

Column type | Active phase | I | Reference | Comment |
---|---|---|---|---|
Capillary | PE-5 | 1153. | Isidorov and Vinogorova, 2003 | He, 5. K/min; Column length: 30. m; Column diameter: 0.25 mm; Tstart: 50. C; Tend: 250. C |
Capillary | OV-101 | 1156. | Misharina, Vitt, et al., 1986 | He, 40. C @ 4. min, 2. K/min; Column length: 50. m; Column diameter: 0.32 mm; Tend: 250. C |
Packed | OV-1 | 1132. | Mattsson and Petersson, 1977 | N2, Supelcoport, 4. K/min; Column length: 2. m; Tstart: 80. C; Tend: 240. C |

Van Den Dool and Kratz RI, non-polar column, custom temperature program

Column type | Active phase | I | Reference | Comment |
---|---|---|---|---|
Capillary | VF-5MS | 1150.9 | Tret'yakov, 2008 | 30. m/0.25 mm/0.25 μm, He; Program: Multi-step temperature program; T(initial)=60C; T(final)=270C |

References

Isidorov and Vinogorova, 2003
Isidorov, V.A.; Vinogorova, V.T.,
GC-MS analysis of compounds extracted from buds of Populus balsamifera and Populus nigra,
Z. Naturforsch. C:, 2003, 58, 355-360. [all data]
Misharina, Vitt, et al., 1986
Misharina, T.A.; Vitt, S.V.; Golovnya, R.V.; Belikov, V.M.,
The use of chemical modification for combined chromatographic-mass spectrometric identification of isomeric thiophene and furan substances,
Zh. Anal. Khim., 1986, 61, 10, 1876-1881. [all data]
Mattsson and Petersson, 1977
Mattsson, M.; Petersson, G.,
Reference GLC Data for the Analysis of Phenolic Compounds as Trimethylsilyl Derivatives,
J. Chromatogr. Sci., 1977, 15, 12, 546-554, https://doi.org/10.1093/chromsci/15.12.546
. [all data]
Tret'yakov, 2008
Tret'yakov, K.V.,
Retention Data. NIST Mass Spectrometry Data Center., NIST Mass Spectrometry Data Center, 2008. [all data]