Bis(trimethylsilyl)acetylene
- Formula: C8H18Si2
- Molecular weight: 170.3995
- IUPAC Standard InChIKey: ZDWYFWIBTZJGOR-UHFFFAOYSA-N
- CAS Registry Number: 14630-40-1
- Chemical structure:
View 3d structure (requires JavaScript / HTML 5) - Other names: 1,2-Bis(trimethylsilyl)acetylene; Silane, 1,2-ethynediylbis[trimethyl-; 2,5-Disilahex-3-yne, 2,2,5,5-tetramethyl-; Acetylene, bis(trimethylsilyl)-; Bis(trimethylsilyl)ethyne; 1,2-Bis(trimethylsilyl)ethyne; Silane, 1,1'-(1,2-ethynediyl)bis[1,1,1-trimethyl-

Phase change data

Data compiled by: Robert L. Brown and Stephen E. Stein
Quantity | Value | Units | Method | Reference | Comment |
---|---|---|---|---|---|
Tboil | 409. to 410. | K | N/A | Farchan Laboratories, 1990 | |
Tboil | 406. to 408. | K | N/A | PCR Inc., 1990 | |
Tboil | 409. to 410. | K | N/A | Buckingham and Donaghy, 1982 |

References

Farchan Laboratories, 1990
Farchan Laboratories,
Research Chemicals Catalog, Farchan Laboratories, Gainesville, FL, 1990, 91. [all data]
PCR Inc., 1990
PCR Inc.,
Research Chemicals Catalog 1990-1991, PCR Inc., Gainesville, FL, 1990, 1. [all data]
Buckingham and Donaghy, 1982
Buckingham, J.; Donaghy, S.M.,
Dictionary of Organic Compounds: Fifth Edition, Chapman and Hall, New York, 1982, 1. [all data]