Cyclopentanol, 1-ethyl-
- Formula: C7H14O
- Molecular weight: 114.1855
- IUPAC Standard InChIKey: LPCWIFPJLFCXRS-UHFFFAOYSA-N
- CAS Registry Number: 1462-96-0
- Chemical structure:
View 3d structure (requires JavaScript / HTML 5) - Other names: 1-Ethylcyclopentanol; 1-Ethyl-1-cyclopentanol

Phase change data

Data compiled by: William E. Acree, Jr., James S. Chickos
Enthalpy of vaporization
ΔvapH (kJ/mol) | Temperature (K) | Method | Reference | Comment |
---|---|---|---|---|
58.4 | 362. | A | Stephenson and Malanowski, 1987 | Based on data from 347. to 426. K. See also Kkykj and Repas, 1973. |

References

Stephenson and Malanowski, 1987
Stephenson, Richard M.; Malanowski, Stanislaw,
Handbook of the Thermodynamics of Organic Compounds, 1987, https://doi.org/10.1007/978-94-009-3173-2
. [all data]
Kkykj and Repas, 1973
Kkykj, J.; Repas, M.,
Petrochemia, 1973, 13, 179. [all data]