4-methyl-1,4-pentanediol

Phase change data

Data compiled by: Thermodynamics Research Center, NIST Boulder Laboratories, Chris Muzny director

Quantity Value Units Method Reference Comment
Tboil491.65KN/AFranke and Kohn, 1908Uncertainty assigned by TRC = 4. K

In addition to the Thermodynamics Research Center (TRC) data available from this site, much more physical and chemical property data is available from the following TRC products:

References

Franke and Kohn, 1908
Franke, A.; Kohn, M., Monatsh. Chem., 1908, 28, 997. [all data]