2-Butoxypropionic acid
- Formula: C7H14O3
- Molecular weight: 146.1843
- IUPAC Standard InChIKey: LXSVWFRZICUOLU-UHFFFAOYSA-N
- CAS Registry Number: 14620-87-2
- Chemical structure:
View 3d structure (requires JavaScript / HTML 5) - Permanent link for this species. Use this link for bookmarking this species for future reference.

Phase change data

Data compiled by: William E. Acree, Jr., James S. Chickos
Enthalpy of vaporization
ΔvapH (kJ/mol) | Temperature (K) | Method | Reference | Comment |
---|---|---|---|---|
52.8 | 388. | A | Stephenson and Malanowski, 1987 | Based on data from 373. to 473. K. See also Kkykj and Repas, 1973. |

References

Stephenson and Malanowski, 1987
Stephenson, Richard M.; Malanowski, Stanislaw,
Handbook of the Thermodynamics of Organic Compounds, 1987, https://doi.org/10.1007/978-94-009-3173-2
. [all data]
Kkykj and Repas, 1973
Kkykj, J.; Repas, M.,
Petrochemia, 1973, 13, 179. [all data]