Cyclopentanol, 1-methyl-

Reaction thermochemistry data

Data compiled by: John E. Bartmess

Individual Reactions

C6H11O- + Hydrogen cation = Cyclopentanol, 1-methyl-

By formula: C6H11O- + H+ = C6H12O

Quantity Value Units Method Reference Comment
Δr1559. ± 8.4kJ/molCIDCHaas and Harrison, 1993gas phase; Both metastable and 50 eV collision energy.
Quantity Value Units Method Reference Comment
Δr1532. ± 8.8kJ/molH-TSHaas and Harrison, 1993gas phase; Both metastable and 50 eV collision energy.

Van Den Dool and Kratz RI, non-polar column, temperature ramp

Data compiled by: NIST Mass Spectrometry Data Center, William E. Wallace, director

Column type Capillary
Active phase DB-5
Column length (m) 30.
Carrier gas He
Substrate
Column diameter (mm) 0.25
Phase thickness (μm)
Tstart (C) 50.
Tend (C) 250.
Heat rate (K/min) 4.
Initial hold (min)
Final hold (min)
I 796.
ReferenceGómez, Ledbetter, et al., 1993
Comment MSDC-RI

Kovats' RI, non-polar column, isothermal

Data compiled by: NIST Mass Spectrometry Data Center, William E. Wallace, director

Column type PackedPacked
Active phase Apiezon LApiezon L
Column length (m) 2.252.25
Carrier gas
Substrate CeliteCelite
Column diameter (mm)
Phase thickness (μm)
Temperature (C) 130.190.
I 770.782.
ReferenceWehrli and Kováts, 1959Wehrli and Kováts, 1959
Comment MSDC-RI MSDC-RI

References

Haas and Harrison, 1993
Haas, M.J.; Harrison, A.G., The Fragmentation of Proton-Bound Cluster Ions and the Gas-Phase Acidities of Alcohols, Int. J. Mass Spectrom. Ion Proc., 1993, 124, 2, 115, https://doi.org/10.1016/0168-1176(93)80003-W . [all data]