Cyclohexene, 1-methyl-5-(1-methylethenyl)-, (R)-
- Formula: C10H16
- Molecular weight: 136.2340
- IUPAC Standard InChIKey: JWQKMEKSFPNAIB-SNVBAGLBSA-N
- CAS Registry Number: 1461-27-4
- Chemical structure:
View 3d structure (requires JavaScript / HTML 5) - Stereoisomers:
- Other names: m-Mentha-6,8-diene, (R)-(+)-; (+)-m-Mentha-1(6),8-diene; (+)-Sylvestrene; D-sylvestrene; m-Mentha-1,8-diene, (+)-; Sylvestrene; Sylvestrene, (+)-; 5-Isopropenyl-1-methyl-1-cyclohexene, (R)-; (R)-1-Methyl-5-(1-methylvinyl)cyclohexene; Isosylvestrene; m-Mentha-6,8-diene

Condensed phase thermochemistry data

Data compiled by: Hussein Y. Afeefy, Joel F. Liebman, and Stephen E. Stein
Quantity | Value | Units | Method | Reference | Comment |
---|---|---|---|---|---|
ΔcH°liquid | -6136.3 | kJ/mol | Ccb | Auwsers, Roth, et al., 1910 | Corresponding ΔfHºliquid = -85.4 kJ/mol (simple calculation by NIST; no Washburn corrections) |

Kovats' RI, non-polar column, isothermal

Column type | Active phase | Temperature (C) | I | Reference | Comment |
---|---|---|---|---|---|
Packed | Squalane | 86. | 1018. | Hively and Hinton, 1968 | He, Chromosorb P; Column length: 15. m; Column diameter: 0.25 mm |

Kovats' RI, non-polar column, temperature ramp

Column type | Active phase | I | Reference | Comment |
---|---|---|---|---|
Capillary | SE-54 | 1027. | Adams, 2000 | 30. m/0.26 mm/0.25 μm, 3. K/min; Tstart: 60. C; Tend: 246. C |
Capillary | DB-5 | 1027. | Adams, 2000, 2 | 30. m/0.26 mm/0.25 μm, He, 3. K/min; Tstart: 60. C; Tend: 246. C |
Capillary | DB-5 | 1028. | Adams, 1999 | 30. m/0.26 mm/0.25 μm, He, 3. K/min; Tstart: 60. C; Tend: 246. C |

Van Den Dool and Kratz RI, non-polar column, custom temperature program

Column type | Active phase | I | Reference | Comment |
---|---|---|---|---|
Capillary | BPX-5 | 1032. | Cardeal, da Silva, et al., 2006 | 30. m/0.25 mm/0.25 μm; Program: 35C(5min) => 3C/min => 210C => 40C/min => 240C (4min) |

Van Den Dool and Kratz RI, polar column, custom temperature program

Column type | Active phase | I | Reference | Comment |
---|---|---|---|---|
Capillary | HP-Innowax | 1200. | Bisio, Ciarallo, et al., 1998 | 30. m/0.25 mm/0.25 μm, He; Program: 60C(8min) => 3C/min => 180C(5min) => 40C/min => 250C |

Normal alkane RI, non-polar column, isothermal

Column type | Active phase | Temperature (C) | I | Reference | Comment |
---|---|---|---|---|---|
Capillary | DB-5 | 25. | 1027. | Hemmateenejad, Jawadnia, et al., 2007 |

Normal alkane RI, non-polar column, temperature ramp

Column type | Active phase | I | Reference | Comment |
---|---|---|---|---|
Capillary | HP-5 | 1009. | Bertoli, Lepnardi, et al., 2011 | 30. m/0.25 mm/0.25 μm, Helium, 3. K/min; Tstart: 60. C; Tend: 240. C |
Capillary | DB-5 | 1024. | Rahimi-Nasrabadi, Gholivand, et al., 2009 | 30. m/0.25 mm/0.25 μm, Nitrogen, 40. C @ 1. min, 3. K/min, 250. C @ 10. min |
Capillary | 5 % Phenyl methyl siloxane | 1032. | Retta, Gattuso, et al., 2009 | 60. m/0.25 mm/0.25 μm, Helium, 3. K/min, 225. C @ 3. min; Tstart: 90. C |
Capillary | DB-5 MS | 1028. | Noudogbessi, Yedomonhan, et al., 2008 | 30. m/0.25 mm/0.25 μm, Helium, 50. C @ 5. min, 5. K/min, 300. C @ 5. min |
Capillary | HP-5 MS | 1027. | Adams, Beauchamp, et al., 2007 | 30. m/0.25 mm/0.25 μm, Helium, 50. C @ 10. min, 3. K/min, 230. C @ 10. min |
Capillary | DB-5MS | 1006. | Marongiu, Piras, et al., 2005 | 30. m/0.25 mm/0.25 μm, He, 60. C @ 30. min, 3. K/min; Tend: 280. C |
Capillary | SPB-5 | 1029. | Gauvin, Ravaomanarivo, et al., 2004 | 60. m/0.32 mm/1. μm, He, 4. K/min, 200. C @ 30. min; Tstart: 60. C |
Capillary | DB-5 | 1026. | Maia, da Silva, et al., 2002 | 30. m/0.25 mm/0.25 μm, He, 3. K/min; Tstart: 60. C; Tend: 240. C |

Normal alkane RI, non-polar column, custom temperature program

Column type | Active phase | I | Reference | Comment |
---|---|---|---|---|
Capillary | CBP-5 | 1030. | de Morais, Oliveira, et al., 2012 | 30. m/0.25 mm/0.25 μm, Helium; Program: 60 0C 3 0C/min -> 240 0C 10 0C/min -> 280 0C (10 min) |
Capillary | DB-5 | 1021. | Courtois, Paine, et al., 2009 | 30. m/0.25 mm/0.25 μm, Helium; Program: 50 0C m6 0C/min -> 140 0C 5 0C/min -> 160 0C (1 min) 10 0C/min -> 200 0C |
Capillary | DB-5 | 1027. | Pontes, de Oliveira, et al., 2007 | 30. m/0.25 mm/0.25 μm, Hydrogen; Program: 35 0C (2 min) 4 0C/min -> 180 0C 20 0C -> 280 0C |
Capillary | DB-5 | 1019. | Cysne, Canuto, et al., 2005 | 30. m/0.25 mm/0.25 μm, He; Program: 35C => 4C/min => 180C => 10C/min => 250C |
Capillary | SE-30 | 1016. | Vinogradov, 2004 | Program: not specified |
Capillary | OV-101 | 1016. | Zenkevich, 1998 | He; Column length: 25. m; Column diameter: 0.20 mm; Program: not specified |
Capillary | OV-101 | 1018. | Zenkevich, 1998 | He; Column length: 25. m; Column diameter: 0.20 mm; Program: not specified |
Capillary | DB-5 | 1032. | Isidorov, Zenkevich, et al., 1997 | Program: not specified |
Capillary | Methyl Silicone | 1016. | Zenkevich, 1996 | Program: not specified |

Normal alkane RI, polar column, temperature ramp

Column type | Active phase | I | Reference | Comment |
---|---|---|---|---|
Capillary | Supelcowax-10 | 1177. | Gauvin, Ravaomanarivo, et al., 2004 | 60. m/0.2 mm/0.2 μm, He, 4. K/min, 200. C @ 40. min; Tstart: 60. C |

Normal alkane RI, polar column, custom temperature program

Column type | Active phase | I | Reference | Comment |
---|---|---|---|---|
Capillary | HP Innowax FSP | 1205. | Wedge, Klun, et al., 2009 | 60. m/0.25 mm/0.25 μm, Helium; Program: 60 0C (10 min) 4 0C/min -> 220 0C (10 min) 1 0C/min -> 240 0C (20 min) |

References

Auwsers, Roth, et al., 1910
Auwsers, K.; Roth, W.A.; Eisenlohr, F.,
III. Verbrennungswarmen von Terpenen und Styrolen,
Justus Liebigs Ann. Chem., 1910, 267-290. [all data]
Hively and Hinton, 1968
Hively, R.A.; Hinton, R.E.,
Variation of the retention index with temperature on squalane substrates,
J. Gas Chromatogr., 1968, 6, 4, 203-217, https://doi.org/10.1093/chromsci/6.4.203
. [all data]
Adams, 2000
Adams, R.P.,
Systematics of the one seeded Juniperus of the eastern hemisphere based on leaf essential oils and random amplified polymorphic DNAs (RAPDs),
Biochem. Syst. Ecol., 2000, 28, 6, 529-543, https://doi.org/10.1016/S0305-1978(99)00096-4
. [all data]
Adams, 2000, 2
Adams, R.P.,
The serrate leaf margined Juniperus (Section Sabina) of the western hemisphere: systematics and evolution based on leaf essential oils and Random Amplified Polymorphic DNAs (RAPDs),
Biochem. Syst. Ecol., 2000, 28, 10, 975-989, https://doi.org/10.1016/S0305-1978(00)00022-3
. [all data]
Adams, 1999
Adams, R.P.,
Systematics of multi-seeded eastern hemisphere Juniperus based on leaf essential oils and RAPD DNA fingerprinting,
Biochem. Syst. Ecol., 1999, 27, 7, 709-725, https://doi.org/10.1016/S0305-1978(99)00016-2
. [all data]
Cardeal, da Silva, et al., 2006
Cardeal, Z.L.; da Silva, M.D.R.G.; Marriott, P.J.,
Comprehensive two-dimensional gas chromatography/mass spectrometric analysis of pepper volatiles,
Rapid Commun. Mass Spectrom., 2006, 20, 19, 2823-2836, https://doi.org/10.1002/rcm.2665
. [all data]
Bisio, Ciarallo, et al., 1998
Bisio, A.; Ciarallo, G.; Romussi, G.; Fontana, N.; Mascolo, N.; Capasso, R.; Biscardi, D.,
Chemical Composition of Essential Oils from some Salvia species,
Phytother. Res., 1998, 12, S1, s117-s120, https://doi.org/10.1002/(SICI)1099-1573(1998)12:1+3.0.CO;2-2
. [all data]
Hemmateenejad, Jawadnia, et al., 2007
Hemmateenejad, B.; Jawadnia, K.; Elyasi, M.,
Quantitative structure - retention relationship for the Kovats retention indices of a large set of terpenes: a comdined data splitting-feature selection strategy,
Anal. Chim. Acta, 2007, 592, 1, 72-81, https://doi.org/10.1016/j.aca.2007.04.009
. [all data]
Bertoli, Lepnardi, et al., 2011
Bertoli, A.; Lepnardi, M.; Krzyzanowska, J.; Oleszek, W.; Pistelli, L.,
Mentha longifolia in vitro cultures as safe source of flavouring ingradients,
Acta Biochem. Polonica, 2011, 58, 4, 581-587. [all data]
Rahimi-Nasrabadi, Gholivand, et al., 2009
Rahimi-Nasrabadi, M.; Gholivand, M.B.; Batooli, H.; Vatanara, A.,
Chemical composition of the essential oil from leaves and flowering aerial parts of Psammogeton canscens (DC). Vake from Iran,
J. Medicinal Plants, 2009, 8, 31, 82-86. [all data]
Retta, Gattuso, et al., 2009
Retta, D.; Gattuso, M.; Gattuso, S.; Lira, P. Di Leo; van Baren, C.; Ferraro, G.; Bandoni A.,
Essential oil composition of Achyrocline flaccida (Weinm.) DC. (Asteraceae) from different locations of Argentina,
Biochem. Systematics Ecol., 2009, 36, 12, 877-881, https://doi.org/10.1016/j.bse.2008.11.001
. [all data]
Noudogbessi, Yedomonhan, et al., 2008
Noudogbessi, J.-P.; Yedomonhan, P.; Sohounhloue, D.C.K.; Chalchat, J.-C.; Figueredo, G.,
Chemical composition of essential oil of syzygium guineense (Willd.) DC. var. guineense (Myrtaceae) from Benin,
Rec. Nat. Prod., 2008, 33-38. [all data]
Adams, Beauchamp, et al., 2007
Adams, R.P.; Beauchamp, P.S.; Dev, V.; Dutz, S.M.,
New Natural Products Isolated from One-Seeded Juniperus of the Southwestern United States: Isolation and Occurence of 2-Ethenyl-3-methyl Phanol and Its Derivatives,
J. Essent. Oil Res., 2007, 19, 2, 146-152, https://doi.org/10.1080/10412905.2007.9699247
. [all data]
Marongiu, Piras, et al., 2005
Marongiu, B.; Piras, A.; Porcedda, S.; Scorciapino, A.,
Chemical composition of the essential oil and supercritical CO2 extract of Commiphora myrrha (Nees) Engl. and of Acorus calamus L.,
J. Agric. Food Chem., 2005, 53, 20, 7939-7943, https://doi.org/10.1021/jf051100x
. [all data]
Gauvin, Ravaomanarivo, et al., 2004
Gauvin, A.; Ravaomanarivo, H.; Smadja, J.,
Comparative analysis by gas chromatography?mass spectrometry of the essential oils from bark and leaves of Cedrelopsis grevei Baill, an aromatic and medicinal plant from Madagascar,
J. Chromatogr. A, 2004, 1029, 1-2, 279-282, https://doi.org/10.1016/j.chroma.2003.12.012
. [all data]
Maia, da Silva, et al., 2002
Maia, J.G.S.; da Silva, M.H.L.; Andrade, E.H.A.; Zoghbi, M.G.B.; Carreira, L.M.M.,
Essential oils from Astronium urundeuva (Allemao) Engl. and A. fraxinifolium Schott ex Spreng.,
Flavour Fragr. J., 2002, 17, 1, 72-74, https://doi.org/10.1002/ffj.1046
. [all data]
de Morais, Oliveira, et al., 2012
de Morais, S.R.; Oliveira, T.L.S.; BAra, M.T.F.; da Conceicao, E.C.; Rezende, M.H.; Ferri, P.H.; de Paula, J.R.,
Chemical constituents of essential oil from Lippia sidoides Cham. (Verbenaceae) leaves cultivated in Hidrolandia, Goias, Brasil,
Int. J. Anal. Chem., 2012, 2012, 1-4, https://doi.org/10.1155/2012/363919
. [all data]
Courtois, Paine, et al., 2009
Courtois, E.A.; Paine, C.E.; Blandinieres, P.-A.; Stien, D.; Bessiere, J.-M.; Houel, E.; Baraloto, C.; Chave, J.,
Diversity of the volatile organic compounds emitted by 55 species of tropical trees: a survey in French Guiana,
J. Chem. Ecol., 2009, 35, 11, 1349-1362, https://doi.org/10.1007/s10886-009-9718-1
. [all data]
Pontes, de Oliveira, et al., 2007
Pontes, W.J.T.; de Oliveira, J.C.S.; da Camara, C.A.G.; Lopes, A.C.H.R.; Gondim, M.G.C.G.; de Oliveira, J.V.; Schwartz, M.O.E.,
Composition and acaricidal activity of the resin's essential oil of Protium bahianum Daly against two spotted spider mite (Tetranychus Urticae),
J. Essent. Oil Res., 2007, 19, 4, 379-383, https://doi.org/10.1080/10412905.2007.9699310
. [all data]
Cysne, Canuto, et al., 2005
Cysne, J.B.; Canuto, K.M.; Pessoa, O.D.L.; Nunes, E.P.; Silveira, E.R.,
Leaf essential oils of four Piper species from the State of Ceará - Northeast of Brazil,
J. Braz. Chem. Soc., 2005, 16, 6B, 1378-1381, https://doi.org/10.1590/S0103-50532005000800012
. [all data]
Vinogradov, 2004
Vinogradov, B.A.,
Production, composition, properties and application of essential oils, 2004, retrieved from http://viness.narod.ru. [all data]
Zenkevich, 1998
Zenkevich, I.G.,
Application of Methods of Molecular Dynamics in Chromato-Spectral Identification of ISomeric Products of Organic reactions (in Russian),
Zh. Org. Khim., 1998, 34, 10, 1463-1470. [all data]
Isidorov, Zenkevich, et al., 1997
Isidorov, V.; Zenkevich, I.; Sacharevich, T.,
Calculation of Gas Chromatographic Retention Indices for Monoterpenes and Terpenoids from Their Physico-Chemical Constants,
Chem. Anal. (Warsaw), 1997, 42, 627-634. [all data]
Zenkevich, 1996
Zenkevich, I.G.,
Analytical Parameters of Components of Essential Oils for their Chromatographic and Chromato-Mass Spectral Identification. Mono- and Sesquiterpenes,
Rastitelnye Resursy (Plant resources), 1996, 34, 1-2, 48-58. [all data]
Wedge, Klun, et al., 2009
Wedge, D.E.; Klun, J.A.; Tabanca, N.; Demirci, B.; Ozek, T.; Baser, K.H.C.; Liu, Z.; Zhang, S.; Cantrell, C.L.; Zhang, J.,
Bioactivity-guided fractionation and GC/MS fingerprinting of Amgelica sinensis and Angelica archangelica root components for antifungal and mosquito deterrent activity,
J. Agric. Food Chem., 2009, 57, 2, 464-470, https://doi.org/10.1021/jf802820d
. [all data]