Selegiline
- Formula: C13H17N
- Molecular weight: 187.2808
- IUPAC Standard InChIKey: MEZLKOACVSPNER-UHFFFAOYSA-N
- CAS Registry Number: 14611-51-9
- Chemical structure:
View 3d structure (requires JavaScript / HTML 5) - Other names: (R)-((-))-N,α-Dimethyl-N-2-propynylphenethylamine; (-)-Deprenil; Eldepryl; Jumex; L-Deprenyl; N-Methyl-N-(1-methyl-2-phenylethyl)-2-propyn-1-amine-, L-(-)-; Selegiline-, (-)-; (-)-Selegiline; Anipryl; Benzeneethanamine, N,α-methyl-N-2-propynyl-, (αR)-; Movergan; Plurimen; (-)-(R)-N,α-Dimethyl-N,2-propynylphenethylamine hydrochloride; Benzeneethanamine, N,α-dimethyl-N-2-propyn-1-yl-, (αR)-; Benzeneethanamine, N,.alpha.-dimethyl-N-2-propynyl-, (R)-

Van Den Dool and Kratz RI, non-polar column, temperature ramp

Column type | Active phase | I | Reference | Comment |
---|---|---|---|---|
Capillary | VF-5MS | 1439.7 | Tretyakov, 2014 | 30. m/0.25 mm/0.25 μm, He; Tstart: 60. C; Tend: 270. C |

References

Tretyakov, 2014
Tretyakov, K.V.,
Retention Data. NIST Mass Spectrometry Data Center., NIST Mass Spectrometry Data Center, 2014. [all data]