N-tert-Butylmethylamine
- Formula: C5H13N
- Molecular weight: 87.1634
- IUPAC Standard InChIKey: ZQGJEUVBUVKZKS-UHFFFAOYSA-N
- CAS Registry Number: 14610-37-8
- Chemical structure:
View 3d structure (requires JavaScript / HTML 5) - Other names: 2-Propanamine, N,2-dimethyl-; N-Methyl-tert-butylamine; tert-butyl-methyl-amine

Phase change data

Data compiled as indicated in comments:
TRC - Thermodynamics Research Center, NIST Boulder Laboratories, Chris Muzny director
AC - William E. Acree, Jr., James S. Chickos
Quantity | Value | Units | Method | Reference | Comment |
---|---|---|---|---|---|
Tboil | 346.65 | K | N/A | Bortnick, Luskin, et al., 1956 | Uncertainty assigned by TRC = 1.5 K; TRC |
Tboil | 332.15 | K | N/A | Sabatier and Mailhe, 1907 | Uncertainty assigned by TRC = 4. K; TRC |
Enthalpy of vaporization
ΔvapH (kJ/mol) | Temperature (K) | Reference | Comment |
---|---|---|---|
32.3 ± 1.4 | 297. | Verevkin, 1997 | Based on data from 270. to 288. K.; AC |

Kovats' RI, non-polar column, isothermal

Column type | Active phase | Temperature (C) | I | Reference | Comment |
---|---|---|---|---|---|
Packed | Apiezon L | 100. | 607. | Golovnya, Zhuravleva, et al., 1981 | N2, Chromosorb GAW; Column length: 2.7 m |

References

Bortnick, Luskin, et al., 1956
Bortnick, N.; Luskin, L.S.; Hurwitz, M.D.; Craig, W.E.; Exner, L.J.; Mirza, J.,
T-carbinamines, rr'r''cnh(2): I reaction with alkyl halides and alkylene oxides,
J. Am. Chem. Soc., 1956, 78, 4039. [all data]
Sabatier and Mailhe, 1907
Sabatier, P.; Mailhe, A.,
C. R. Hebd. Seances Acad. Sci., 1907, 144, 955. [all data]
Verevkin, 1997
Verevkin, Sergey P.,
Thermochemistry of amines: experimental standard molar enthalpies of formation of some aliphatic and aromatic amines,
The Journal of Chemical Thermodynamics, 1997, 29, 8, 891-899, https://doi.org/10.1006/jcht.1997.0212
. [all data]
Golovnya, Zhuravleva, et al., 1981
Golovnya, R.V.; Zhuravleva, I.L.; Svetlova, N.I.; Grigor'eva, D.N.; Terenina, M.B.; Gutnik, S.B.,
Gas-chromatographic behavior of secondary isoaliphatic and alicyclic amines,
J. Anal. Chem. USSR (Engl. Transl.), 1981, 36, 4, 501-505. [all data]