1,2-Cyclohexanediol, trans-
- Formula: C6H12O2
- Molecular weight: 116.1583
- IUPAC Standard InChIKey: PFURGBBHAOXLIO-PHDIDXHHSA-N
- CAS Registry Number: 1460-57-7
- Chemical structure:
View 3d structure (requires JavaScript / HTML 5) - Stereoisomers:
- Other names: trans-1,2-Cyclohexanediol; trans-1,2-Dihydroxycyclohexane; 1,2-trans-Cyclohexanediol; 1,2-Cyclohexanediol, (E)-; trans-cyclohexane-1,2-diol

Condensed phase thermochemistry data

Data compiled by: Hussein Y. Afeefy, Joel F. Liebman, and Stephen E. Stein
Quantity | Value | Units | Method | Reference | Comment |
---|---|---|---|---|---|
ΔcH°solid | -3520. ± 0.8 | kJ/mol | Ccb | Verkade, Coops, et al., 1928 | At 288 °K; Corresponding ΔfHºsolid = -555.6 kJ/mol (simple calculation by NIST; no Washburn corrections) |

Phase change data

Data compiled as indicated in comments:
TRC - Thermodynamics Research Center, NIST Boulder Laboratories, Chris Muzny director
AC - William E. Acree, Jr., James S. Chickos
Quantity | Value | Units | Method | Reference | Comment |
---|---|---|---|---|---|
Tfus | 376.65 | K | N/A | Emmons, Pagano, et al., 1954 | Uncertainty assigned by TRC = 1.5 K; TRC |
Enthalpy of sublimation
ΔsubH (kJ/mol) | Temperature (K) | Method | Reference | Comment |
---|---|---|---|---|
85.9 ± 1.4 | 343. | C | Maria, Costa, et al., 1995 | AC |
42.5 | 304. | ME | Stephenson and Malanowski, 1987 | Based on data from 289. to 320. K. See also Zibberman-Granovskaya, 1940.; AC |
Enthalpy of fusion
ΔfusH (kJ/mol) | Temperature (K) | Method | Reference | Comment |
---|---|---|---|---|
21.0 | 382.6 | N/A | Maria and Eusebio, 2008 | AC |
16.37 | 375.7 | DSC | Zhou, Peng, et al., 2002 | See also Zhou, Zhang, et al., 2003.; AC |
18.51 | 372.3 | N/A | Maria, Costa, et al., 1995 | AC |

References

Verkade, Coops, et al., 1928
Verkade, P.E.; Coops, J., Jr.; Maan, Chr.J.,
Calorimetrische Untersuchungen. XV. Thermochemische studien uber cycloparaffine und ihre derivate: 1. Experimentelle daten fur funf- und sechsgliedrige cyclische diole,
Ann., 1928, 467, 217-239. [all data]
Emmons, Pagano, et al., 1954
Emmons, W.D.; Pagano, A.S.; Freeman, J.P.,
J. Am. Chem. Soc., 1954, 76, 3472. [all data]
Maria, Costa, et al., 1995
Maria, Teresa M.R.; Costa, Felisbela S.; Leitão, M. Luísa P.; Redinha, J.S.,
A calorimetric study of phase transitions for some cyclohexanediols,
Thermochimica Acta, 1995, 269-270, 405-413, https://doi.org/10.1016/0040-6031(95)02704-1
. [all data]
Stephenson and Malanowski, 1987
Stephenson, Richard M.; Malanowski, Stanislaw,
Handbook of the Thermodynamics of Organic Compounds, 1987, https://doi.org/10.1007/978-94-009-3173-2
. [all data]
Zibberman-Granovskaya, 1940
Zibberman-Granovskaya, A.A.,
Russ. J. Phys. Chem., 1940, 14, 759. [all data]
Maria and Eusebio, 2008
Maria, Teresa M.R.; Eusebio, M. Ermelinda S.,
Molar Heat Capacity of 1,2-Cyclohexanediol Isomers From (173 to 428) K,
J. Chem. Eng. Data, 2008, 53, 6, 1316-1320, https://doi.org/10.1021/je800047t
. [all data]
Zhou, Peng, et al., 2002
Zhou, C.-R.; Peng, G.-S.; Zhang, Y.-D.; Jiang, D.G.; Wang, F.; Li, J.-J.; Shen, X.-Q.,
Gaoxiao Huaxue Gongcheng Xuebao, 2002, 16, 3, 237. [all data]
Zhou, Zhang, et al., 2003
Zhou, C.; Zhang, Y.; Jiang, D.,
Chin. J. Chem. Eng., 2003, 11, 5, 598. [all data]