Cycloheptanecarboxylic acid
- Formula: C8H14O2
- Molecular weight: 142.1956
- IUPAC Standard InChIKey: VZFUCHSFHOYXIS-UHFFFAOYSA-N
- CAS Registry Number: 1460-16-8
- Chemical structure:
View 3d structure (requires JavaScript / HTML 5) - Permanent link for this species. Use this link for bookmarking this species for future reference.

Phase change data

Data compiled by: Robert L. Brown and Stephen E. Stein
Reduced pressure boiling point
Tboil (K) | Pressure (atm) | Reference |
---|---|---|
409.7 | 0.01 | Aldrich Chemical Company Inc., 1990 |
529.2 | 0.936 | Weast and Grasselli, 1989 |
403.7 | 0.01 | Weast and Grasselli, 1989 |

References

Aldrich Chemical Company Inc., 1990
Aldrich Chemical Company Inc.,
Catalog Handbook of Fine Chemicals, Aldrich Chemical Company, Inc., Milwaukee WI, 1990, 1. [all data]
Weast and Grasselli, 1989
CRC Handbook of Data on Organic Compounds, 2nd Editon, Weast,R.C and Grasselli, J.G., ed(s)., CRC Press, Inc., Boca Raton, FL, 1989, 1. [all data]