Boron cation
- Formula: B+
- Molecular weight: 10.810
- CAS Registry Number: 14594-80-0

Gas phase thermochemistry data

Quantity | Value | Units | Method | Reference | Comment |
---|---|---|---|---|---|
S°gas,1 bar | 138.55 | J/mol*K | Review | Chase, 1998 | Data last reviewed in June, 1983 |

Reaction thermochemistry data

Data compiled by: Michael M. Meot-Ner (Mautner) and Sharon G. Lias
Individual Reactions
By formula: (B+ • 10B) + B = (B+ • 11B)
Quantity | Value | Units | Method | Reference | Comment |
---|---|---|---|---|---|
ΔrH° | 531. ± 50. | kJ/mol | CID | Hanley, Whitten, et al., 1988 | gas phase; ΔrH< |
By formula: (B+ • 11B) + B = (B+ • 12B)
Quantity | Value | Units | Method | Reference | Comment |
---|---|---|---|---|---|
ΔrH° | 770. ± 150. | kJ/mol | CID | Hanley, Whitten, et al., 1988 | gas phase; ΔrH< |
By formula: (B+ • 9B) + B = (B+ • 10B)
Quantity | Value | Units | Method | Reference | Comment |
---|---|---|---|---|---|
ΔrH° | 540. ± 75. | kJ/mol | CID | Hanley, Whitten, et al., 1988 | gas phase; ΔrH< |
By formula: (B+ • 2B) + B = (B+ • 3B)
Quantity | Value | Units | Method | Reference | Comment |
---|---|---|---|---|---|
ΔrH° | 770. ± 150. | kJ/mol | CID | Hanley, Whitten, et al., 1988 | gas phase; ΔrH< |
By formula: (B+ • 3B) + B = (B+ • 4B)
Quantity | Value | Units | Method | Reference | Comment |
---|---|---|---|---|---|
ΔrH° | 686. ± 59. | kJ/mol | CID | Hanley, Whitten, et al., 1988 | gas phase; ΔrH< |
By formula: (B+ • 5B) + B = (B+ • 6B)
Quantity | Value | Units | Method | Reference | Comment |
---|---|---|---|---|---|
ΔrH° | 531. ± 67. | kJ/mol | CID | Hanley, Whitten, et al., 1988 | gas phase; ΔrH< |
By formula: (B+ • 8B) + B = (B+ • 9B)
Quantity | Value | Units | Method | Reference | Comment |
---|---|---|---|---|---|
ΔrH° | 523. ± 50. | kJ/mol | CID | Hanley, Whitten, et al., 1988 | gas phase; ΔrH< |
By formula: (B+ • 4B) + B = (B+ • 5B)
Quantity | Value | Units | Method | Reference | Comment |
---|---|---|---|---|---|
ΔrH° | 260. ± 59. | kJ/mol | CID | Hanley, Whitten, et al., 1988 | gas phase; ΔrH< |
By formula: (B+ • 6B) + B = (B+ • 7B)
Quantity | Value | Units | Method | Reference | Comment |
---|---|---|---|---|---|
ΔrH° | 410. ± 50. | kJ/mol | CID | Hanley, Whitten, et al., 1988 | gas phase; ΔrH< |
By formula: (B+ • 7B) + B = (B+ • 8B)
Quantity | Value | Units | Method | Reference | Comment |
---|---|---|---|---|---|
ΔrH° | 380. ± 50. | kJ/mol | CID | Hanley, Whitten, et al., 1988 | gas phase; ΔrH< |
By formula: (B+ • B) + B = (B+ • 2B)
Quantity | Value | Units | Method | Reference | Comment |
---|---|---|---|---|---|
ΔrH° | 410. ± 67. | kJ/mol | CID | Hanley, Whitten, et al., 1988 | gas phase; ΔrH< |
Quantity | Value | Units | Method | Reference | Comment |
---|---|---|---|---|---|
ΔrH° | 75. ± 59. | kJ/mol | CID | Hanley, Whitten, et al., 1988 | gas phase; ΔrH< |

Ion clustering data

Data compiled by: Michael M. Meot-Ner (Mautner) and Sharon G. Lias
Clustering reactions
Quantity | Value | Units | Method | Reference | Comment |
---|---|---|---|---|---|
ΔrH° | 75. ± 59. | kJ/mol | CID | Hanley, Whitten, et al., 1988 | gas phase; ΔrH< |
By formula: (B+ • B) + B = (B+ • 2B)
Quantity | Value | Units | Method | Reference | Comment |
---|---|---|---|---|---|
ΔrH° | 410. ± 67. | kJ/mol | CID | Hanley, Whitten, et al., 1988 | gas phase; ΔrH< |
By formula: (B+ • 2B) + B = (B+ • 3B)
Quantity | Value | Units | Method | Reference | Comment |
---|---|---|---|---|---|
ΔrH° | 770. ± 150. | kJ/mol | CID | Hanley, Whitten, et al., 1988 | gas phase; ΔrH< |
By formula: (B+ • 3B) + B = (B+ • 4B)
Quantity | Value | Units | Method | Reference | Comment |
---|---|---|---|---|---|
ΔrH° | 686. ± 59. | kJ/mol | CID | Hanley, Whitten, et al., 1988 | gas phase; ΔrH< |
By formula: (B+ • 4B) + B = (B+ • 5B)
Quantity | Value | Units | Method | Reference | Comment |
---|---|---|---|---|---|
ΔrH° | 260. ± 59. | kJ/mol | CID | Hanley, Whitten, et al., 1988 | gas phase; ΔrH< |
By formula: (B+ • 5B) + B = (B+ • 6B)
Quantity | Value | Units | Method | Reference | Comment |
---|---|---|---|---|---|
ΔrH° | 531. ± 67. | kJ/mol | CID | Hanley, Whitten, et al., 1988 | gas phase; ΔrH< |
By formula: (B+ • 6B) + B = (B+ • 7B)
Quantity | Value | Units | Method | Reference | Comment |
---|---|---|---|---|---|
ΔrH° | 410. ± 50. | kJ/mol | CID | Hanley, Whitten, et al., 1988 | gas phase; ΔrH< |
By formula: (B+ • 7B) + B = (B+ • 8B)
Quantity | Value | Units | Method | Reference | Comment |
---|---|---|---|---|---|
ΔrH° | 380. ± 50. | kJ/mol | CID | Hanley, Whitten, et al., 1988 | gas phase; ΔrH< |
By formula: (B+ • 8B) + B = (B+ • 9B)
Quantity | Value | Units | Method | Reference | Comment |
---|---|---|---|---|---|
ΔrH° | 523. ± 50. | kJ/mol | CID | Hanley, Whitten, et al., 1988 | gas phase; ΔrH< |
By formula: (B+ • 9B) + B = (B+ • 10B)
Quantity | Value | Units | Method | Reference | Comment |
---|---|---|---|---|---|
ΔrH° | 540. ± 75. | kJ/mol | CID | Hanley, Whitten, et al., 1988 | gas phase; ΔrH< |
By formula: (B+ • 10B) + B = (B+ • 11B)
Quantity | Value | Units | Method | Reference | Comment |
---|---|---|---|---|---|
ΔrH° | 531. ± 50. | kJ/mol | CID | Hanley, Whitten, et al., 1988 | gas phase; ΔrH< |
By formula: (B+ • 11B) + B = (B+ • 12B)
Quantity | Value | Units | Method | Reference | Comment |
---|---|---|---|---|---|
ΔrH° | 770. ± 150. | kJ/mol | CID | Hanley, Whitten, et al., 1988 | gas phase; ΔrH< |

References

Chase, 1998
Chase, M.W., Jr.,
NIST-JANAF Themochemical Tables, Fourth Edition,
J. Phys. Chem. Ref. Data, Monograph 9, 1998, 1-1951. [all data]
Hanley, Whitten, et al., 1988
Hanley, L.; Whitten, J.L.; Anderson, S.L.,
Collision - Induced Dissociation and ab initio Studies of Boron Cluster Ions. Determination of Structures and Stabilities,
J. Phys. Chem., 1988, 92, 20, 5803, https://doi.org/10.1021/j100331a052
. [all data]