Benzene, hexadecyl-
- Formula: C22H38
- Molecular weight: 302.5371
- IUPAC Standard InChIKey: DEQLTFPCJRGSHW-UHFFFAOYSA-N
- CAS Registry Number: 1459-09-2
- Chemical structure:
View 3d structure (requires JavaScript / HTML 5) - Other names: Hexadecane, 1-phenyl-; n-Hexadecylbenzene; Hexadecane, 1(or 16)-phenyl-; Hexadecylbenzene; 1-Phenylhexadecane; Phenyl hexadecane

Phase change data

Data compiled as indicated in comments:
TRC - Thermodynamics Research Center, NIST Boulder Laboratories, Chris Muzny director
AC - William E. Acree, Jr., James S. Chickos
Quantity | Value | Units | Method | Reference | Comment |
---|---|---|---|---|---|
Tfus | 300. ± 20. | K | AVG | N/A | Average of 8 values; Individual data points |
Enthalpy of vaporization
ΔvapH (kJ/mol) | Temperature (K) | Reference | Comment |
---|---|---|---|
79.5 | 520. | Dykyj, Svoboda, et al., 1999 | Based on data from 505. to 688. K.; AC |

References

Dykyj, Svoboda, et al., 1999
Dykyj, J.; Svoboda, J.; Wilhoit, R.C.; Frenkel, M.L.; Hall, K.R.,
Vapor Pressure of Chemicals: Part A. Vapor Pressure and Antoine Constants for Hydrocarbons and Sulfur, Selenium, Tellurium and Hydrogen Containing Organic Compounds, Springer, Berlin, 1999, 373. [all data]