Oxygen cation
- Formula: O+
- Molecular weight: 15.9989
- IUPAC Standard InChIKey: IZZABXNMZJTEGG-UHFFFAOYSA-N
- CAS Registry Number: 14581-93-2
- Chemical structure:
View 3d structure (requires JavaScript / HTML 5) - Information on this page:

Gas phase thermochemistry data

Quantity | Value | Units | Method | Reference | Comment |
---|---|---|---|---|---|
S°gas,1 bar | 154.96 | J/mol*K | Review | Chase, 1998 | Data last reviewed in September, 1982 |

Reaction thermochemistry data

Data compiled by: Michael M. Meot-Ner (Mautner) and Sharon G. Lias
Individual Reactions
By formula: O+ + O2 = (O+ • O2)
Quantity | Value | Units | Method | Reference | Comment |
---|---|---|---|---|---|
ΔrH° | 179. | kJ/mol | PDiss | Hiller and Vestal, 1982 | gas phase |
ΔrH° | 200. | kJ/mol | PI | Linn, Ono, et al., 1981 | gas phase |
ΔrH° | 209. | kJ/mol | PDiss | Mosely, Ozenne, et al., 1981 | gas phase |
By formula: (O+ • 2O2) + O2 = (O+ • 3O2)
Quantity | Value | Units | Method | Reference | Comment |
---|---|---|---|---|---|
ΔrH° | 4. | kJ/mol | PI | Linn, Ono, et al., 1981 | gas phase |
By formula: (O+ • O2) + O2 = (O+ • 2O2)
Quantity | Value | Units | Method | Reference | Comment |
---|---|---|---|---|---|
ΔrH° | 29. | kJ/mol | PI | Linn, Ono, et al., 1981 | gas phase |

Ion clustering data

Data compiled by: Michael M. Meot-Ner (Mautner) and Sharon G. Lias
Clustering reactions
By formula: O+ + O2 = (O+ • O2)
Quantity | Value | Units | Method | Reference | Comment |
---|---|---|---|---|---|
ΔrH° | 179. | kJ/mol | PDiss | Hiller and Vestal, 1982 | gas phase |
ΔrH° | 200. | kJ/mol | PI | Linn, Ono, et al., 1981 | gas phase |
ΔrH° | 209. | kJ/mol | PDiss | Mosely, Ozenne, et al., 1981 | gas phase |
By formula: (O+ • O2) + O2 = (O+ • 2O2)
Quantity | Value | Units | Method | Reference | Comment |
---|---|---|---|---|---|
ΔrH° | 29. | kJ/mol | PI | Linn, Ono, et al., 1981 | gas phase |
By formula: (O+ • 2O2) + O2 = (O+ • 3O2)
Quantity | Value | Units | Method | Reference | Comment |
---|---|---|---|---|---|
ΔrH° | 4. | kJ/mol | PI | Linn, Ono, et al., 1981 | gas phase |

References

Chase, 1998
Chase, M.W., Jr.,
NIST-JANAF Themochemical Tables, Fourth Edition,
J. Phys. Chem. Ref. Data, Monograph 9, 1998, 1-1951. [all data]
Hiller and Vestal, 1982
Hiller, J.F.; Vestal, M.L.,
Laser Photodissociation of O3+ and the Energetics of Ozone and its Ions,
J. Chem. Phys., 1982, 77, 3, 1248, https://doi.org/10.1063/1.444000
. [all data]
Linn, Ono, et al., 1981
Linn, S.H.; Ono, Y.; Ng, C.Y.,
A Study of the Ion - Molecule Half Reactions O2+(a4piu, v)...(O2)m ---> O2m+1 + O, m=1, 2, 3, Using the Molecular Beam Photoionization Method,
J. Chem. Phys., 1981, 74, 6, 3348, https://doi.org/10.1063/1.441487
. [all data]
Mosely, Ozenne, et al., 1981
Mosely, J.T.; Ozenne, J.B.; Cosby, P.C.,
Photofragment Spectroscopy of O3+,
J. Chem. Phys., 1981, 74, 1, 337, https://doi.org/10.1063/1.440839
. [all data]