[1S-(1α,2β,5α)]-2,6,6-trimethylbicyclo[3.1.1]heptan-3-one
- Formula: C10H16O
- Molecular weight: 152.2334
- IUPAC Standard InChIKey: MQPHVIPKLRXGDJ-WPZUCAASSA-N
- CAS Registry Number: 14575-93-0
- Chemical structure:
View 3d structure (requires JavaScript / HTML 5) - Stereoisomers:
- Other names: Bicyclo[3.1.1]heptan-3-one, 2,6,6-trimethyl-, [1s-(1α,2β,5α)]-

Gas phase thermochemistry data

Data compiled by: Hussein Y. Afeefy, Joel F. Liebman, and Stephen E. Stein
Quantity | Value | Units | Method | Reference | Comment |
---|---|---|---|---|---|
ΔfH°gas | -149. ± 8.4 | kJ/mol | Ccb | Steele, 1979 |

References

Steele, 1979
Steele, W.V.,
Thermochemically determined ΔH°f(g) values for ketones and alcohols,
Private Communication, University of Stirling, Stirling, Scotland, 1979, 0. [all data]