1-Nonanethiol
- Formula: C9H20S
- Molecular weight: 160.320
- IUPAC Standard InChIKey: ZVEZMVFBMOOHAT-UHFFFAOYSA-N
- CAS Registry Number: 1455-21-6
- Chemical structure:
View 3d structure (requires JavaScript / HTML 5) - Other names: n-Nonyl mercaptan; Nonyl mercaptan; Nonylthiol; 1-Nonylthiol; nonane-1-thiol

Phase change data

Data compiled as indicated in comments:
BS - Robert L. Brown and Stephen E. Stein
TRC - Thermodynamics Research Center, NIST Boulder Laboratories, Chris Muzny director
AC - William E. Acree, Jr., James S. Chickos
Quantity | Value | Units | Method | Reference | Comment |
---|---|---|---|---|---|
Tboil | 493.2 | K | N/A | Weast and Grasselli, 1989 | BS |
Quantity | Value | Units | Method | Reference | Comment |
Tfus | 253.1 | K | N/A | Teets, 1934 | Uncertainty assigned by TRC = 0.3 K; TRC |
Tfus | 253.1 | K | N/A | Ellis and Reid, 1932 | Uncertainty assigned by TRC = 0.3 K; TRC |
Enthalpy of vaporization
ΔvapH (kJ/mol) | Temperature (K) | Method | Reference | Comment |
---|---|---|---|---|
52.6 | 405. | A | Stephenson and Malanowski, 1987 | Based on data from 390. to 494. K. See also Dykyj, Svoboda, et al., 1999 and Ellis and Reid, 1932, 2.; AC |
Enthalpy of fusion
ΔfusH (kJ/mol) | Temperature (K) | Reference | Comment |
---|---|---|---|
33.5 | 267.7 | Lange, 1985 | AC |

Kovats' RI, non-polar column, isothermal

Column type | Active phase | Temperature (C) | I | Reference | Comment |
---|---|---|---|---|---|
Packed | Apiezon M | 130. | 1233. | Garbuzov, Misharina, et al., 1985 | He or N2, Chromosorb W, AW-DMCS; Column length: 2.1 m |
Packed | OV-101 | 130. | 1218. | Zygmunt, Wardencki, et al., 1983 | Ar, Gas-Chrom Q; Column length: 1.5 m |
Packed | OV-101 | 130. | 1219. | Zygmunt, Wardencki, et al., 1983 | Ar, Gas-Chrom Q; Column length: 1.5 m |
Packed | Apiezon M | 130. | 1233. | Golovnya and Garbuzov, 1974 | N2, Chromosorb W; Column length: 2.1 m |
Packed | SE-30 | 130. | 1219. | Golovnya and Arsen'ev, 1970 | Column length: 1.5 m |
Packed | DC-200 | 120. | 1218. | Golovnya and Arsen'ev, 1970 | Column length: 1.5 m |

Kovats' RI, non-polar column, custom temperature program

Column type | Active phase | I | Reference | Comment |
---|---|---|---|---|
Capillary | Apiezon M | 1233. | Zhu, Wang, et al., 2007 | Program: not specified |

Kovats' RI, polar column, custom temperature program

Column type | Active phase | I | Reference | Comment |
---|---|---|---|---|
Capillary | PEG-20M | 1470. | Zhu, Wang, et al., 2007 | Program: not specified |

References

Weast and Grasselli, 1989
CRC Handbook of Data on Organic Compounds, 2nd Editon, Weast,R.C and Grasselli, J.G., ed(s)., CRC Press, Inc., Boca Raton, FL, 1989, 1. [all data]
Teets, 1934
Teets, D.E.,
The Relation of the Melting Point to the Number of Carbon Atoms in a Series of Normal Mercaptans,
J. Am. Chem. Soc., 1934, 56, 1143. [all data]
Ellis and Reid, 1932
Ellis, L.M.; Reid, E.E.,
The Preparation and Properties of A Double Series of Aliphatic Mercaptans,
J. Am. Chem. Soc., 1932, 54, 1674. [all data]
Stephenson and Malanowski, 1987
Stephenson, Richard M.; Malanowski, Stanislaw,
Handbook of the Thermodynamics of Organic Compounds, 1987, https://doi.org/10.1007/978-94-009-3173-2
. [all data]
Dykyj, Svoboda, et al., 1999
Dykyj, J.; Svoboda, J.; Wilhoit, R.C.; Frenkel, M.L.; Hall, K.R.,
Vapor Pressure of Chemicals: Part A. Vapor Pressure and Antoine Constants for Hydrocarbons and Sulfur, Selenium, Tellurium and Hydrogen Containing Organic Compounds, Springer, Berlin, 1999, 373. [all data]
Ellis and Reid, 1932, 2
Ellis, L.M.; Reid, E. Emmet,
THE PREPARATION AND PROPERTIES OF A DOUBLE SERIES OF ALIPHATIC MERCAPTANS 1,2,3,
J. Am. Chem. Soc., 1932, 54, 4, 1674-1687, https://doi.org/10.1021/ja01343a067
. [all data]
Lange, 1985
Lange, N.A.,
Lange's Handbook of Chemistry, 13th Edition, J.A. Dean, ed(s)., McGraw-Hill, New York, NY, 1985, 1792. [all data]
Garbuzov, Misharina, et al., 1985
Garbuzov, V.G.; Misharina, T.A.; Aerov, A.F.; Golovnya, R.V.,
Gas chromatographic retention indices for sulphur(II)-containing organic substances,
J. Anal. Chem. USSR (Engl. Transl.), 1985, 40, 4, 576-586. [all data]
Zygmunt, Wardencki, et al., 1983
Zygmunt, B.; Wardencki, W.; Staszewski, R.,
Gas chromatographic identification of thiols in the naphta cut from Libyan crude oil,
J. Chromatogr., 1983, 265, 136-138, https://doi.org/10.1016/S0021-9673(01)96709-3
. [all data]
Golovnya and Garbuzov, 1974
Golovnya, R.V.; Garbuzov, V.G.,
Effect of heteroatom in aliphatic sulfur- and oxygen-containing compounds on the values of the retention indices in gas chromatography,
Izv. Akad. Nauk SSSR Ser. Khim., 1974, 7, 1519-1521. [all data]
Golovnya and Arsen'ev, 1970
Golovnya, R.V.; Arsen'ev, Y.N.,
Gas-chromatographic method for the analysis of n-mercaptans and symmetrical n-sulfides and n-disulfides,
Bull. Acad. Sci. USSR, Div. Chem. Sci. (Engl. Transl.), 1970, 6, 4, 1316-1318, https://doi.org/10.1007/BF00852683
. [all data]
Zhu, Wang, et al., 2007
Zhu, X.H.; Wang, W.; Schramm, K.-W.; Niu, W.,
Prediction of the Kova´ ts Retention Indices of Thiols by Use of Quantum Chemical and Physicochemical Descriptors,
Chromatographia, 2007, 65, 11-12, 719-724, https://doi.org/10.1365/s10337-007-0237-3
. [all data]