n-Nonadecanol-1
- Formula: C19H40O
- Molecular weight: 284.5203
- IUPAC Standard InChIKey: XGFDHKJUZCCPKQ-UHFFFAOYSA-N
- CAS Registry Number: 1454-84-8
- Chemical structure:
View 3d structure (requires JavaScript / HTML 5) - Other names: 1-Nonadecanol; Nonadecanol; Nonadecan-1-ol; Nonadecyl alcohol

Phase change data

Data compiled as indicated in comments:
BS - Robert L. Brown and Stephen E. Stein
TRC - Thermodynamics Research Center, NIST Boulder Laboratories, Chris Muzny director
AC - William E. Acree, Jr., James S. Chickos
Quantity | Value | Units | Method | Reference | Comment |
---|---|---|---|---|---|
Tfus | 334.65 | K | N/A | Gaikwad and Subrahmanyam, 1985 | Uncertainty assigned by TRC = 0.5 K; TRC |
Tfus | 336. | K | N/A | Scholl and Morrison, 1954 | Uncertainty assigned by TRC = 4. K; TRC |
Tfus | 333. | K | N/A | Cason, Wolfhagen, et al., 1949 | Uncertainty assigned by TRC = 4. K; TRC |
Reduced pressure boiling point
Tboil (K) | Pressure (bar) | Reference | Comment |
---|---|---|---|
439.7 | 0.0004 | Weast and Grasselli, 1989 | BS |
Enthalpy of vaporization
ΔvapH (kJ/mol) | Temperature (K) | Method | Reference | Comment |
---|---|---|---|---|
81.7 | 494. | A | Stephenson and Malanowski, 1987 | Based on data from 479. to 640. K.; AC |
80.0 | 509. | A | Stephenson and Malanowski, 1987 | Based on data from 494. to 635. K.; AC |
Enthalpy of fusion
ΔfusH (kJ/mol) | Temperature (K) | Method | Reference | Comment |
---|---|---|---|---|
43.3 | 333.9 | DSC | Ventol«65533», Calvet, et al., 2004 | AC |
43.3 | 333.9 | DSC | Ventolà, Ramírez, et al., 2002 | AC |
72.42 | 334.5 | N/A | van Miltenburg, Oonk, et al., 2001 | Value includes the enthalpy of a solid/solid transition that occurs at about 331 K; AC |

Kovats' RI, non-polar column, isothermal

Column type | Active phase | Temperature (C) | I | Reference | Comment |
---|---|---|---|---|---|
Capillary | CP Sil 5 CB | 240. | 2176. | Hanai and Hong, 1989 | 30. m/0.25 mm/0.25 μm |
Capillary | DB-1 | 240. | 2176. | Hanai and Hong, 1989 | 30. m/0.25 mm/0.25 μm |

Kovats' RI, non-polar column, temperature ramp

Column type | Active phase | I | Reference | Comment |
---|---|---|---|---|
Capillary | BP-1 | 2150. | Srivastava, Srivastava, et al., 2006 | 30. m/0.32 mm/0.25 μm, N2, 5. K/min, 220. C @ 3. min; Tstart: 60. C |
Capillary | DB-5MS | 2181. | Palmeira, Moura, et al., 2004 | 30. m/0.25 mm/0.25 μm, He, 3. K/min; Tstart: 60. C; Tend: 240. C |
Capillary | BP-1 | 2162. | Raina, Srivastava, et al., 2003 | 25. m/0.32 mm/0.25 μm, N2, 5. K/min, 220. C @ 15. min; Tstart: 60. C |

Kovats' RI, non-polar column, custom temperature program

Column type | Active phase | I | Reference | Comment |
---|---|---|---|---|
Capillary | BP-1 | 2150. | Khan, Srivastava, et al., 2003 | 25. m/0.25 mm/0.25 μm, N2; Program: 60C => 5C/min => 220C (5min) => 3C/min => 245 C (5min) |
Capillary | BP-1 | 2160. | Raina, Srivastava, et al., 2003, 2 | 25. m/0.32 mm/0.25 μm, N2; Program: 60C => 5C/min => 220C(5min) => 3C/min => 245C(5min) |
Capillary | BP-1 | 2150. | Khan, Srivastava, et al., 2002 | 30. m/0.32 mm/0.25 μm, N2; Program: 60 C 5 C/min -> 220 C (5 min) 3 C/min -> 245 C (5 min) |

Kovats' RI, polar column, isothermal

Column type | Active phase | Temperature (C) | I | Reference | Comment |
---|---|---|---|---|---|
Capillary | CP-Wax | 240. | 2652. | Hanai and Hong, 1989 | 25. m/0.25 mm/0.22 μm |
Capillary | DB-Wax | 240. | 2687. | Hanai and Hong, 1989 | 25. m/0.25 mm/0.22 μm |

Van Den Dool and Kratz RI, non-polar column, temperature ramp

Column type | Active phase | I | Reference | Comment |
---|---|---|---|---|
Capillary | Mega 5MS | 2176. | Condurso, Verzera, et al., 2006 | 60. m/0.25 mm/0.25 μm, He, 3. K/min; Tstart: 60. C; Tend: 240. C |
Capillary | HP-5 | 2156. | Lazari, Skaltsa, et al., 2000 | 30. m/0.25 mm/0.25 μm, He, 50. C @ 5. min, 4. K/min; Tend: 280. C |

Van Den Dool and Kratz RI, non-polar column, custom temperature program

Column type | Active phase | I | Reference | Comment |
---|---|---|---|---|
Capillary | VF-5MS | 2194.7 | Zheng and White, 2008 | 30. m/0.25 mm/0.25 μm, He; Program: not specified |

Van Den Dool and Kratz RI, polar column, temperature ramp

Column type | Active phase | I | Reference | Comment |
---|---|---|---|---|
Capillary | Carbowax 20M | 2637. | Schwab, Mahr, et al., 1989 | 30. m/0.25 mm/0.25 μm, He, 40. C @ 3. min, 4. K/min; Tend: 240. C |

Van Den Dool and Kratz RI, polar column, custom temperature program

Column type | Active phase | I | Reference | Comment |
---|---|---|---|---|
Capillary | CP-Wax 52CB | 2646. | Condurso, Verzera, et al., 2006 | 60. m/0.25 mm/0.25 μm, He; Program: 45C(5min) => 10C/min => 80C => 2C/min => 240C |

Normal alkane RI, non-polar column, temperature ramp

Column type | Active phase | I | Reference | Comment |
---|---|---|---|---|
Capillary | HP-5 MS | 2172. | Radulovic, Blagojevic, et al., 2010 | 30. m/0.25 mm/0.25 μm, Helium, 5. K/min, 290. C @ 10. min; Tstart: 70. C |
Capillary | SPB-5 | 2175. | Pino, Marbot, et al., 2002 | 30. m/0.25 mm/0.25 μm, Helium, 60. C @ 2. min, 4. K/min, 250. C @ 20. min |

Normal alkane RI, non-polar column, custom temperature program

Column type | Active phase | I | Reference | Comment |
---|---|---|---|---|
Capillary | ZB-1 MS | 2153. | Al-Reza, Rahman, et al., 2009 | 30. m/0.25 mm/0.25 μm, Helium; Program: 50 0C 3 0C/min -> 150 0C (10 min) 10 0C/min -> 250 0C |

References

Gaikwad and Subrahmanyam, 1985
Gaikwad, B.R.; Subrahmanyam, V.V.,
Melting behavior of fatty alcohols and their binary blends.,
J. Indian Chem. Soc., 1985, 62, 513. [all data]
Scholl and Morrison, 1954
Scholl, A.W.; Morrison, J.G.,
Preparation and Properties of n-nonadecyl and n-eicosyl formates,
West Va. Univ. Bull., Proc. West Va Acad. Sci., 1954, 26, 35-7. [all data]
Cason, Wolfhagen, et al., 1949
Cason, J.; Wolfhagen, H.J.; Targey, W.; Adams, R.E.,
Branched-chain fatty acids: x synthesis of acids with branching methyl groups near the carboxyl,
J. Org. Chem., 1949, 14, 147-54. [all data]
Weast and Grasselli, 1989
CRC Handbook of Data on Organic Compounds, 2nd Editon, Weast,R.C and Grasselli, J.G., ed(s)., CRC Press, Inc., Boca Raton, FL, 1989, 1. [all data]
Stephenson and Malanowski, 1987
Stephenson, Richard M.; Malanowski, Stanislaw,
Handbook of the Thermodynamics of Organic Compounds, 1987, https://doi.org/10.1007/978-94-009-3173-2
. [all data]
Ventol«65533», Calvet, et al., 2004
Ventol«65533», L.; Calvet, T.; Cuevas-Diarte, M.A.; Ram«65533»rez, M.; Oonk, H.A.J.; Mondieig, D.; Negrier, Ph.,
Melting behaviour in the n-alkanol family. Enthalpy?entropy compensation,
Phys. Chem. Chem. Phys., 2004, 6, 8, 1786, https://doi.org/10.1039/b313106h
. [all data]
Ventolà, Ramírez, et al., 2002
Ventolà, L.; Ramírez, M.; Calvet, T.; Solans, X.; Cuevas-Diarte, M.A.; Negrier, P.; Mondieig, D.; van Miltenburg, J.C.; Oonk, H.A.J.,
Polymorphism of N -Alkanols: 1-Heptadecanol, 1-Octadecanol, 1-Nonadecanol, and 1-Eicosanol,
Chem. Mater., 2002, 14, 2, 508-517, https://doi.org/10.1021/cm011010h
. [all data]
van Miltenburg, Oonk, et al., 2001
van Miltenburg, J. Cees; Oonk, Harry A.J.; Ventola, Lourdes,
Heat Capacities and Derived Thermodynamic Functions of 1-Octadecanol, 1-Nonadecanol, 1-Eicosanol, and 1-Docosanol between 10 K and 370 K,
J. Chem. Eng. Data, 2001, 46, 1, 90-97, https://doi.org/10.1021/je000048s
. [all data]
Hanai and Hong, 1989
Hanai, T.; Hong, C.,
Structure-retention correlation in CGC,
J. Hi. Res. Chromatogr., 1989, 12, 5, 327-332, https://doi.org/10.1002/jhrc.1240120517
. [all data]
Srivastava, Srivastava, et al., 2006
Srivastava, A.K.; Srivastava, S.K.; Syamsundar, K.V.,
Volatile composition of Curcuma angustifolia Roxb. rhizome from central and southern India,
Flavour Fragr. J., 2006, 21, 3, 423-426, https://doi.org/10.1002/ffj.1680
. [all data]
Palmeira, Moura, et al., 2004
Palmeira, S.F., Jr.; Moura, F.S.; Alves, V.L.; de Oliveira, F.M.; Bento, E.S.; Conserva, L.M.; Andrade, E.H.A.,
Neutral components from hexane extracts of Croton sellowii,
Flavour Fragr. J., 2004, 19, 1, 69-71, https://doi.org/10.1002/ffj.1298
. [all data]
Raina, Srivastava, et al., 2003
Raina, V.K.; Srivastava, S.K.; Syamasunder, K.V.,
Essential oil composition of Acorus calamus L. from the lower region of the Himalayas,
Flavour Fragr. J., 2003, 18, 1, 18-20, https://doi.org/10.1002/ffj.1136
. [all data]
Khan, Srivastava, et al., 2003
Khan, M.; Srivastava, S.K.; Jain, N.; Syamasundar, K.V.; Yadav, A.K.,
Chemical composition of fruit and stem essential oils of Lantana camara from northern India,
Flavour Fragr. J., 2003, 18, 5, 376-379, https://doi.org/10.1002/ffj.1197
. [all data]
Raina, Srivastava, et al., 2003, 2
Raina, V.K.; Srivastava, S.K.; Aggarwal, K.K.; Syamasunder, K.V.; Khanuja, S.P.S.,
Essential oil composition of Cymbopogon martinii from different places in India,
Flavour Fragr. J., 2003, 18, 4, 312-315, https://doi.org/10.1002/ffj.1222
. [all data]
Khan, Srivastava, et al., 2002
Khan, M.; Srivastava, S.K.; Syamasundar, K.V.; Singh, M.; Naqvi, A.A.,
Chemical composition of leaf and flower essential oil of Lantana camara from India,
Flavour Fragr. J., 2002, 17, 1, 75-77, https://doi.org/10.1002/ffj.1047
. [all data]
Condurso, Verzera, et al., 2006
Condurso, C.; Verzera, A.; Romeo, V.; Ziino, M.; Trozzi, A.; Ragusa, S.,
The leaf volatile constituents of Isatis tinctoria by solid-phase microextraction and gas chromatography/mass spectrometry,
Planta Medica, 2006, 72, 10, 924-928, https://doi.org/10.1055/s-2006-946679
. [all data]
Lazari, Skaltsa, et al., 2000
Lazari, D.M.; Skaltsa, H.D.; Constantinidis, T.,
Volatile constituents of Centaurea pelia DC., C. thessala Hausskn. subsp. drakiensis (Freyn Sint.) Georg. and C. zuccariniana DC. from Greece,
Flavour Fragr. J., 2000, 15, 1, 7-11, https://doi.org/10.1002/(SICI)1099-1026(200001/02)15:1<7::AID-FFJ860>3.0.CO;2-3
. [all data]
Zheng and White, 2008
Zheng, Y.; White, E.,
Retention Data. NIST Mass Spectrometry Data Center., NIST Mass Spectrometry Data Center, 2008. [all data]
Schwab, Mahr, et al., 1989
Schwab, W.; Mahr, C.; Schreier, P.,
Studies on the enzymic hydrolysis of bound aroma components from Carica papaya fruit,
J. Agric. Food Chem., 1989, 37, 4, 1009-1012, https://doi.org/10.1021/jf00088a042
. [all data]
Radulovic, Blagojevic, et al., 2010
Radulovic, N.; Blagojevic, P.; Palic, R.,
Comparative study of the leaf volatiles of Arctostaphylos uva-ursi (L.) Spreng. and Vaccinium vitis-idaea L. (Ericaceae),
Molecules, 2010, 15, 9, 6168-6185, https://doi.org/10.3390/molecules15096168
. [all data]
Pino, Marbot, et al., 2002
Pino, J.A.; Marbot, R.; Vazquez, C.,
Characterization of volatiles in Loquat fruit (Eriobotrya japonica Lindl.),
Revista CENIC Ciencias Quimicas, 2002, 33, 3, 115-119. [all data]
Al-Reza, Rahman, et al., 2009
Al-Reza, S.M.; Rahman, A.; Kang, S.C.,
Chemical composition and inhibitory effect of essentiasl oil and organic extracts of Cestrum nocturnum L. om food-borne pathogens,
Int. J. Food Sci. Technol., 2009, 44, 6, 1176-1182, https://doi.org/10.1111/j.1365-2621.2009.01939.x
. [all data]