5-tert-Butyl-4,6-dinitro-1,2,3-trimethylbenzene
- Formula: C13H18N2O4
- Molecular weight: 266.2930
- IUPAC Standard InChIKey: MINYPECWDZURGR-UHFFFAOYSA-N
- CAS Registry Number: 145-39-1
- Chemical structure:
View 3d structure (requires JavaScript / HTML 5) - Other names: Benzene, 1-(1,1-dimethylethyl)-3,4,5-trimethyl-2,6-dinitro-; Benzene, 1-(1,1-dimethylethyl)-2,6-dinitro-3,4,5-trimethyl-; Benzene, 1-tert-butyl-2,6-dinitro-3,4,5-trimethyl-; Benzene, 1-tert-butyl-3,4,5-trimethyl-2,6-dinitro-; Musk tibetene; Tibetene musk; 5-tert-Butyl-1,2,3-trimethyl-4,6-dinitrobenzene; 5-t-Butyl-4,6-dinitro-1,2,3-trimethylbenzene; Musk tibetine; NSC 78470; 1-tert-Butyl-2,6-dinitro-3,4,5-trimethylbenzene; 1-tert-butyl-3,4,5-trimethyl-2,6-dinitrobenzene

Kovats' RI, non-polar column, isothermal

Column type | Active phase | Temperature (C) | I | Reference | Comment |
---|---|---|---|---|---|
Capillary | SE-30 | 100. | 1907.3 | Tudor, 1997 | 40. m/0.35 mm/0.35 μm |

References

Tudor, 1997
Tudor, E.,
Temperature dependence of the retention index for perfumery compounds on a SE-30 glass capillary column. I. Linear equations,
J. Chromatogr. A, 1997, 779, 1-2, 287-297, https://doi.org/10.1016/S0021-9673(97)00453-6
. [all data]