4-Pyridinecarboxamide
- Formula: C6H6N2O
- Molecular weight: 122.1246
- IUPAC Standard InChIKey: VFQXVTODMYMSMJ-UHFFFAOYSA-N
- CAS Registry Number: 1453-82-3
- Chemical structure:
View 3d structure (requires JavaScript / HTML 5) - Other names: Pyridine-4-carboxylic acid amide; γ-Pyridinecarboxamide; Isonicotinic acid amide; 4-Carbamoylpyridine; Isonicotinamide

Phase change data

Data compiled as indicated in comments:
TRC - Thermodynamics Research Center, NIST Boulder Laboratories, Chris Muzny director
AC - William E. Acree, Jr., James S. Chickos
Quantity | Value | Units | Method | Reference | Comment |
---|---|---|---|---|---|
Tfus | 429.15 | K | N/A | Leis and Curran, 1945 | Uncertainty assigned by TRC = 0.5 K; TRC |
Quantity | Value | Units | Method | Reference | Comment |
ΔsubH° | 116.1 ± 1.5 | kJ/mol | C | Ribeiro da Silva, Gonçalves, et al., 2001 | AC |
Enthalpy of sublimation
ΔsubH (kJ/mol) | Temperature (K) | Method | Reference | Comment |
---|---|---|---|---|
99.9 | 397.5 | ME | Stephenson and Malanowski, 1987 | Based on data from 383. to 412. K. See also Negoro, Miki, et al., 1960 and Harutada, 1959.; AC |
Enthalpy of fusion
ΔfusH (kJ/mol) | Temperature (K) | Reference | Comment |
---|---|---|---|
26.81 | 431. | Negoro, Miki, et al., 1960, 2 | AC |

Van Den Dool and Kratz RI, non-polar column, temperature ramp

Column type | Active phase | I | Reference | Comment |
---|---|---|---|---|
Capillary | DB-5 | 1408. | Premecz and Ford, 1987 | He, 60. C @ 10. min, 10. K/min, 280. C @ 3. min; Column length: 30. m; Column diameter: 0.32 mm |

Van Den Dool and Kratz RI, polar column, temperature ramp

Column type | Active phase | I | Reference | Comment |
---|---|---|---|---|
Capillary | CAM | 2894. | Premecz and Ford, 1987 | He, 60. C @ 5. min, 5. K/min, 240. C @ 21. min; Column length: 15. m; Column diameter: 0.24 mm |

References

Leis and Curran, 1945
Leis, D.G.; Curran, B.C.,
Electric moments of some gamma-substituted pyridines,
J. Am. Chem. Soc., 1945, 67, 79. [all data]
Ribeiro da Silva, Gonçalves, et al., 2001
Ribeiro da Silva, Maria D.M.C.; Gonçalves, Jorge M.; Ferreira, Susana C.C.; da Silva, Luís C.M.; Sottomayor, M.J.; Pilcher, G.; Acree Jr, William E.; Roy, Lindsay E.,
Experimental thermochemical study of the enthalpies of formation and sublimation of isonicotinamide, picolinamide, nicotinamide, isonicotinamideN-oxide, and nicotinamideN-oxide. The dissociation enthalpies of the N--O bonds,
The Journal of Chemical Thermodynamics, 2001, 33, 10, 1263-1275, https://doi.org/10.1006/jcht.2001.0839
. [all data]
Stephenson and Malanowski, 1987
Stephenson, Richard M.; Malanowski, Stanislaw,
Handbook of the Thermodynamics of Organic Compounds, 1987, https://doi.org/10.1007/978-94-009-3173-2
. [all data]
Negoro, Miki, et al., 1960
Negoro, H.; Miki, T.; Ueda, S.,
Yakugaku Zasshi, 1960, 80, 665. [all data]
Harutada, 1959
Harutada, N.,
Takamine Kenkyusho Nempo, 1959, 11, 66. [all data]
Negoro, Miki, et al., 1960, 2
Negoro, H.; Miki, T.; Ueda, S.; Sanada, T.; Okada, R.,
Yakugaku Zasshi, 1960, 80, 670. [all data]
Premecz and Ford, 1987
Premecz, J.E.; Ford, M.E.,
Gas chromatographic separation of substituted pyridines,
J. Chromatogr., 1987, 388, 23-35, https://doi.org/10.1016/S0021-9673(01)94463-2
. [all data]