1-Methylcycloheptene
- Formula: C8H14
- Molecular weight: 110.1968
- IUPAC Standard InChIKey: MREBNFRVGNTYOV-UHFFFAOYSA-N
- CAS Registry Number: 1453-25-4
- Chemical structure:
View 3d structure (requires JavaScript / HTML 5) - Other names: Cycloheptene, 1-methyl-

Phase change data

Data compiled by: Thermodynamics Research Center, NIST Boulder Laboratories, Chris Muzny director
Quantity | Value | Units | Method | Reference | Comment |
---|---|---|---|---|---|
Tboil | 409.2 | K | N/A | Turner and Garner, 1958 | Uncertainty assigned by TRC = 2. K |
Tboil | 408. | K | N/A | Cope, Bumgardner, et al., 1957 | Uncertainty assigned by TRC = 3. K |
Tboil | 407.9 | K | N/A | Cope, Bumgardner, et al., 1957 | Uncertainty assigned by TRC = 4. K |

Reaction thermochemistry data

Data compiled by: Hussein Y. Afeefy, Joel F. Liebman, and Stephen E. Stein
Individual Reactions
By formula: H2 + C8H14 = C8H16
Quantity | Value | Units | Method | Reference | Comment |
---|---|---|---|---|---|
ΔrH° | -100.5 ± 0.4 | kJ/mol | Chyd | Turner and Garner, 1958, 2 | liquid phase; solvent: Acetic acid |
ΔrH° | -100.5 ± 0.4 | kJ/mol | Chyd | Turner and Garner, 1957 | liquid phase; solvent: Acetic acid |

Kovats' RI, non-polar column, isothermal

Column type | Active phase | Temperature (C) | I | Reference | Comment |
---|---|---|---|---|---|
Packed | Squalane | 120. | 874. | Bogoslovsky, Anvaer, et al., 1978 | |
Packed | Squalane | 70. | 862. | Bogoslovsky, Anvaer, et al., 1978 | |
Capillary | Squalane | 120. | 874. | Schomburg, 1966 | |
Capillary | Squalane | 70. | 862. | Schomburg, 1966 | |
Capillary | Squalane | 80. | 863. | Schomburg, 1966 | |
Packed | Apiezon L | 130. | 909. | Wehrli and Kováts, 1959 | Celite; Column length: 2.25 m |

Normal alkane RI, non-polar column, custom temperature program

Column type | Active phase | I | Reference | Comment |
---|---|---|---|---|
Capillary | Methyl Silicone | 868. | Zenkevich, 2000 | Program: not specified |

References

Turner and Garner, 1958
Turner, R.B.; Garner, R.H.,
Heats of Hydrogenation V. Relative Stabilities in Certain Exocyclic- Endocyclic Olefin Pairs,
J. Am. Chem. Soc., 1958, 80, 1424. [all data]
Cope, Bumgardner, et al., 1957
Cope, A.C.; Bumgardner, C.L.; Schweizer, E.E.,
Amine Oxides IV. Alicyclic Olefins from Aine Oxides and Quaternary Ammonium Hydroxides,
J. Am. Chem. Soc., 1957, 79, 4729-33. [all data]
Turner and Garner, 1958, 2
Turner, R.B.; Garner, R.H.,
Heats of hydrogenation. V. Relative stabilities in certain exocyclic-endocyclic olefin pairs,
J. Am. Chem. Soc., 1958, 80, 1424-1430. [all data]
Turner and Garner, 1957
Turner, R.B.; Garner, R.H.,
Heats of hydrogenation. V. Relative stabilities in certain exocyclic-endocyclic olefin pairs,
J. Am. Chem. Soc., 1957, 80, 1424-1430. [all data]
Bogoslovsky, Anvaer, et al., 1978
Bogoslovsky, Yu.N.; Anvaer, B.I.; Vigdergauz, M.S.,
Chromatographic constants in gas chromatography (in Russian), Standards Publ. House, Moscow, 1978, 192. [all data]
Schomburg, 1966
Schomburg, G.,
Gaschromatographische Retentionsdaten und struktur chemischer verbindungen. III. Alkylverzweigte und ungesättigte cyclische Kohlenwasserstoffe,
J. Chromatogr., 1966, 23, 18-41, https://doi.org/10.1016/S0021-9673(01)98653-4
. [all data]
Wehrli and Kováts, 1959
Wehrli, A.; Kováts, E.,
Gas-chromatographische Charakterisierung ogranischer Verbindungen. Teil 3: Berechnung der Retentionsindices aliphatischer, alicyclischer und aromatischer Verbindungen,
Helv. Chim. Acta, 1959, 7, 7, 2709-2736, https://doi.org/10.1002/hlca.19590420745
. [all data]
Zenkevich, 2000
Zenkevich, I.G.,
Mutual Correlation between Gas Chromatographic Retention Indices of Unsaturated and Saturated Hydrocarbons found by Molecular Dynamics,
Z. Anal. Chem., 2000, 55, 10, 1091-1097. [all data]