hexane-1-sulphonyl chloride
- Formula: C6H13ClO2S
- Molecular weight: 184.684
- IUPAC Standard InChIKey: AEHJDQSLTMFLQO-UHFFFAOYSA-N
- CAS Registry Number: 14532-24-2
- Chemical structure:
View 3d structure (requires JavaScript / HTML 5) - Other names: 1-Hexanesulfonyl chloride

Phase change data

Data compiled by: William E. Acree, Jr., James S. Chickos
Enthalpy of vaporization
ΔvapH (kcal/mol) | Temperature (K) | Reference | Comment |
---|---|---|---|
14.5 | 288. | Dykyj, Svoboda, et al., 1999 | Based on data from 273. to 304. K. See also Quitzsch, Nowak, et al., 1963. |
14.7 | 318. | Dykyj, Svoboda, et al., 1999 | Based on data from 303. to 400. K. |
13.7 | 415. | Dykyj, Svoboda, et al., 1999 | Based on data from 400. to 507. K. |

References

Dykyj, Svoboda, et al., 1999
Dykyj, J.; Svoboda, J.; Wilhoit, R.C.; Frenkel, M.L.; Hall, K.R.,
Vapor Pressure of Chemicals: Part A. Vapor Pressure and Antoine Constants for Hydrocarbons and Sulfur, Selenium, Tellurium and Hydrogen Containing Organic Compounds, Springer, Berlin, 1999, 373. [all data]
Quitzsch, Nowak, et al., 1963
Quitzsch, K.; Nowak, C.; Winkler, P.; Geiseler, G.,
Dampfdruck- und Grenzfl«65533»chenverhalten homologer prim«65533»rer Alkansulfochloride,
J. Prakt. Chem., 1963, 20, 1-2, 92-98, https://doi.org/10.1002/prac.19630200111
. [all data]