Picolinamide
- Formula: C6H6N2O
- Molecular weight: 122.1246
- IUPAC Standard InChIKey: IBBMAWULFFBRKK-UHFFFAOYSA-N
- CAS Registry Number: 1452-77-3
- Chemical structure:
View 3d structure (requires JavaScript / HTML 5) - Other names: Pyridine-2-carboxamide; α-Picolinamide; 2-Pyridinecarboxamide; α-Picolinic acid amide; Picolinic acid amide; Picolinoylamide; 2-Carbamoylpyridine; Pyridine-2-carboxylicamide

Phase change data

Data compiled by: William E. Acree, Jr., James S. Chickos
Quantity | Value | Units | Method | Reference | Comment |
---|---|---|---|---|---|
ΔsubH° | 93.1 ± 3.3 | kJ/mol | C | Ribeiro da Silva, Gonçalves, et al., 2001 |
Enthalpy of sublimation
ΔsubH (kJ/mol) | Temperature (K) | Method | Reference | Comment |
---|---|---|---|---|
93.1 | 338. | ME | Stephenson and Malanowski, 1987 | Based on data from 323. to 373. K. See also Negoro, Miki, et al., 1960 and Harutada, 1959. |
Enthalpy of fusion
ΔfusH (kJ/mol) | Temperature (K) | Reference |
---|---|---|
16.82 | 381. | Negoro, Miki, et al., 1960, 2 |

Van Den Dool and Kratz RI, non-polar column, temperature ramp

View large format table.

Column type Active phase I Reference Comment
CapillaryDB-51268.Premecz and Ford, 1987He, 60. C @ 10. min, 10. K/min, 280. C @ 3. min; Column length: 30. m; Column diameter: 0.32 mm

Van Den Dool and Kratz RI, polar column, temperature ramp

View large format table.

Column type Active phase I Reference Comment
CapillaryCAM2358.Premecz and Ford, 1987He, 60. C @ 5. min, 5. K/min, 240. C @ 21. min; Column length: 15. m; Column diameter: 0.24 mm

References

Ribeiro da Silva, Gonçalves, et al., 2001
Ribeiro da Silva, Maria D.M.C.; Gonçalves, Jorge M.; Ferreira, Susana C.C.; da Silva, Luís C.M.; Sottomayor, M.J.; Pilcher, G.; Acree Jr, William E.; Roy, Lindsay E.,
Experimental thermochemical study of the enthalpies of formation and sublimation of isonicotinamide, picolinamide, nicotinamide, isonicotinamideN-oxide, and nicotinamideN-oxide. The dissociation enthalpies of the N--O bonds,
The Journal of Chemical Thermodynamics, 2001, 33, 10, 1263-1275, https://doi.org/10.1006/jcht.2001.0839
. [all data]
Stephenson and Malanowski, 1987
Stephenson, Richard M.; Malanowski, Stanislaw,
Handbook of the Thermodynamics of Organic Compounds, 1987, https://doi.org/10.1007/978-94-009-3173-2
. [all data]
Negoro, Miki, et al., 1960
Negoro, H.; Miki, T.; Ueda, S.,
Yakugaku Zasshi, 1960, 80, 665. [all data]
Harutada, 1959
Harutada, N.,
Takamine Kenkyusho Nempo, 1959, 11, 66. [all data]
Negoro, Miki, et al., 1960, 2
Negoro, H.; Miki, T.; Ueda, S.; Sanada, T.; Okada, R.,
Yakugaku Zasshi, 1960, 80, 670. [all data]