bis(8-hydroxy-2-methylquinolinate)copper(II)
- Formula: C20H16CuN2O2
- Molecular weight: 379.899
- CAS Registry Number: 14522-43-1

Phase change data

Data compiled by: William E. Acree, Jr., James S. Chickos
Quantity | Value | Units | Method | Reference | Comment |
---|---|---|---|---|---|
ΔsubH° | 172.1 ± 3.4 | kJ/mol | ME | Ribeiro da Silva, Matos, et al., 1998 | Based on data from 402. to 419. K. |
Enthalpy of sublimation
ΔsubH (kJ/mol) | Temperature (K) | Method | Reference | Comment |
---|---|---|---|---|
166.5 ± 3.4 | 410. | ME | Ribeiro da Silva, Matos, et al., 1998 | Based on data from 402. to 419. K. |

References

Ribeiro da Silva, Matos, et al., 1998
Ribeiro da Silva, Manuel A.V.; Matos, M. Agostinha R.; Gonçalves, Jorge M.,
Standard molar enthalpies of formation and sublimation of some crystalline bis(8-hydroxy-2-methylquinolinate) metal complexes,
The Journal of Chemical Thermodynamics, 1998, 30, 3, 299-310, https://doi.org/10.1006/jcht.1997.0299
. [all data]