N-isopropyl-S-ethyl-N'-tosylisothiourea

Phase change data

Data compiled by: William E. Acree, Jr., James S. Chickos

Enthalpy of fusion

ΔfusH (kJ/mol) Temperature (K) Method Reference
29.1392.2DSCReinke, Hans, et al., 1992

References

Reinke, Hans, et al., 1992
Reinke, Helmut; Hans, Martin; Dehne, Heinz, Infrared spectroscopic and thermal analytical investigations on the polymorphism of N-arylsulphonyl isothioureas, Mikrochim Acta, 1992, 108, 3-6, 143-150, https://doi.org/10.1007/BF01242423 . [all data]