Norcaradiene
- Formula: C7H8
- Molecular weight: 92.1384
- IUPAC Standard InChIKey: BRXCPUJQSHQGEU-UHFFFAOYSA-N
- CAS Registry Number: 14515-09-4
- Chemical structure:
View 3d structure (requires JavaScript / HTML 5) - Permanent link for this species. Use this link for bookmarking this species for future reference.

Reaction thermochemistry data

Data compiled by: Hussein Y. Afeefy, Joel F. Liebman, and Stephen E. Stein
Individual Reactions
C7H8N2O = +
By formula: C7H8N2O = N2O + C7H8
Quantity | Value | Units | Method | Reference | Comment |
---|---|---|---|---|---|
ΔrH° | -68.5 ± 3.6 | kJ/mol | Kin | Oth, Olsen, et al., 1977 | liquid phase; solvent: THF; At 337K |
By formula: C7H8 = C7H8
Quantity | Value | Units | Method | Reference | Comment |
---|---|---|---|---|---|
ΔrH° | 0.669 | kJ/mol | Eqk | Gorlitz and Gunther, 1969 | liquid phase; NMR |

References

Oth, Olsen, et al., 1977
Oth, J.F.M.; Olsen, H.; Synder, J.P.,
Energetics of heteroextrusion reactions. N2 vs. N2O,
J. Am. Chem. Soc., 1977, 99, 8505-8507. [all data]
Gorlitz and Gunther, 1969
Gorlitz, M.; Gunther, H.,
Protonenresonanz-spektroskopie ungesattigter ringsysteme-XIII,
Tetrahedron, 1969, 25, 4467-4480. [all data]