Stannane, tetracyclohexyl-
- Formula: C24H44Sn
- Molecular weight: 451.316
- IUPAC Standard InChIKey: JUISPCSEIXBMNI-UHFFFAOYSA-N
- CAS Registry Number: 1449-55-4
- Chemical structure:

Condensed phase thermochemistry data

Data compiled by: José A. Martinho Simões
Quantity | Value | Units | Method | Reference | Comment |
---|---|---|---|---|---|
ΔfH°solid | -86.4 ± 6.9 | kcal/mol | Review | Martinho Simões | |
Quantity | Value | Units | Method | Reference | Comment |
ΔcH°solid | -3811.8 ± 6.8 | kcal/mol | CC-SB | Lautsch, Tröber, et al., 1963 | Please also see Cox and Pilcher, 1970. |

References

Martinho Simões
Martinho Simões, J.A.,
Private communication (see http://webbook.nist.gov/chemistry/om/). [all data]
Lautsch, Tröber, et al., 1963
Lautsch, W.F.; Tröber, A.; Zimmer, W.; Mehner, L.; Linck, W.; Lehmann, H.M.; Brandenberger, H.; Korner, H.; Metschker, H.-J.; Wagner, K.; Kaden, R.,
Z. Chem., 1963, 3, 415. [all data]
Cox and Pilcher, 1970
Cox, J.D.; Pilcher, G.,
Thermochemistry of Organic and Organometallic Compounds
in Academic Press, New York, 1970. [all data]