Cyclobutanone, 2,2,3-trimethyl-
- Formula: C7H12O
- Molecular weight: 112.1696
- IUPAC Standard InChIKey: XCNUTNIUANPMKW-UHFFFAOYSA-N
- CAS Registry Number: 1449-49-6
- Chemical structure:
View 3d structure (requires JavaScript / HTML 5) - Other names: 2,2,3-Trimethylcyclobutanone

Normal alkane RI, non-polar column, custom temperature program

Column type | Active phase | I | Reference | Comment |
---|---|---|---|---|
Capillary | Methyl Silicone | 787. | Zenkevich, 1998 | Program: not specified |

References

Zenkevich, 1998
Zenkevich, I.G.,
Non-Traditional Criteria for Gas-Chromatographic and Chromato-Mass-Spectrometric Identification of Organic Compounds,
Zh. Anal. Khim., 1998, 53, 8, 828-835. [all data]