Sulfacetamide
- Formula: C8H10N2O3S
- Molecular weight: 214.242
- IUPAC Standard InChIKey: SKIVFJLNDNKQPD-UHFFFAOYSA-N
- CAS Registry Number: 144-80-9
- Chemical structure:
View 3d structure (requires JavaScript / HTML 5) - Other names: Acetamide, N-[(4-aminophenyl)sulfonyl]-; Acetamide, N-sulfanilyl-; p-Aminobenzenesulfonacetamide; A-500; Acetocid; Acetosulfamin; Acetosulfamine; Albamine; Albucid; Alesten; N1-Acetylsulfanilamide; N-[(p-Aminophenyl)sulfonyl]acetamide; N-Acetylsulfanilamide; N-Sulfanilylacetamide; N'-Acetylsulfanilamide; Region; Sulamyd; Sulfacet; Sulfacetimide; Sulfacyl; Sulfanilacetamide; Sulphacetamide; Sulphasil; Urosulfon; N-((4-Aminophenyl)sulfonyl)acetamide; N-Sulphanilylacetamide; Oclucid; Sulfanilamide, N1-acetyl-; Urosulfone; p-Aminobenzenesulfonoacetamide; Bleph-10; Bleph-10 liquifilm; Isopto cetamide; Ophthel-S; Op-sulfa 30; Sebizon; Sulf-10; Sulfanilazetamid; N-(p-Aminobenzenesulfonyl)acetamide; Formosulfacetamide; NSC 63871

Condensed phase thermochemistry data

Data compiled by: Hussein Y. Afeefy, Joel F. Liebman, and Stephen E. Stein
Quantity | Value | Units | Method | Reference | Comment |
---|---|---|---|---|---|
ΔfH°solid | -184.9 | kcal/mol | Ccb | Pushkareva and Kokoshko, 1946 | Author's hf298_condensed=-137.4 kcal/mol |
Quantity | Value | Units | Method | Reference | Comment |
ΔcH°solid | -1053.0 | kcal/mol | Ccb | Pushkareva and Kokoshko, 1946 | Author's hf298_condensed=-137.4 kcal/mol |

Phase change data

Data compiled by: William E. Acree, Jr., James S. Chickos
Enthalpy of fusion
ΔfusH (kcal/mol) | Temperature (K) | Reference |
---|---|---|
7.12 | 455.2 | MartÍnez and GÓmez, 2002 |

References

Pushkareva and Kokoshko, 1946
Pushkareva, Z.V.; Kokoshko, Z.U.,
On the question of the relation between the structure and bacteriostatic activity of sulphanilamide compounds. I. The resonance energy of some sulphanilamide compounds,
Zh. Obshch. Kim., 1946, 16, 1269-1278. [all data]
MartÍnez and GÓmez, 2002
MartÍnez, Fleming; GÓmez, Alfredo,
Estimation of the Solubility of Sulfonamides in Aqueous Media from Partition Coefficients and Entropies of Fusion,
Physics and Chemistry of Liquids, 2002, 40, 4, 411-420, https://doi.org/10.1080/0031910021000017735
. [all data]