4-Hepten-3-one, 5-methyl-

Phase change data

Data compiled as indicated in comments:
BS - Robert L. Brown and Stephen E. Stein
TRC - Thermodynamics Research Center, NIST Boulder Laboratories, Chris Muzny director

Quantity Value Units Method Reference Comment
Tboil439.7KN/AWeast and Grasselli, 1989BS
Tboil438.KN/APowell and Secoy, 1931Uncertainty assigned by TRC = 3. K; TRC

Reduced pressure boiling point

Tboil (K) Pressure (atm) Reference Comment
339.20.024Weast and Grasselli, 1989BS

In addition to the Thermodynamics Research Center (TRC) data available from this site, much more physical and chemical property data is available from the following TRC products:

References

Weast and Grasselli, 1989
CRC Handbook of Data on Organic Compounds, 2nd Editon, Weast,R.C and Grasselli, J.G., ed(s)., CRC Press, Inc., Boca Raton, FL, 1989, 1. [all data]

Powell and Secoy, 1931
Powell, S.G.; Secoy, C.H., The Constitution of Homimesityl Oxide, J. Am. Chem. Soc., 1931, 53, 765. [all data]