propane-1,2,3-triyl tris[(9Z,12Z,15Z)-octadeca-9,12,15-trienoate]
- Formula: C57H92O6
- Molecular weight: 873.3368
- CAS Registry Number: 14465-68-0

Condensed phase thermochemistry data

Data compiled by: Hussein Y. Afeefy, Joel F. Liebman, and Stephen E. Stein
Quantity | Value | Units | Method | Reference | Comment |
---|---|---|---|---|---|
ΔcH°liquid | -8152.00 ± 0.31 | kcal/mol | Ccb | Freedman, Bagby, et al., 1989 | Corresponding ΔfHºliquid = -351.41 kcal/mol (simple calculation by NIST; no Washburn corrections) |

Reaction thermochemistry data

Data compiled by: Hussein Y. Afeefy, Joel F. Liebman, and Stephen E. Stein
Individual Reactions
By formula: 9H2 + C57H92O6 = C57H110O6
Quantity | Value | Units | Method | Reference | Comment |
---|---|---|---|---|---|
ΔrH° | -270.67 | kcal/mol | Chyd | Rogers and Choudhury, 1978 | liquid phase; solvent: Hexane |

References

Freedman, Bagby, et al., 1989
Freedman, B.; Bagby, M.O.; Khoury, H.,
Correlation of heats of combustion with empirical formulas for fatty alcohols,
J. Am. Oil Chem. Soc., 1989, 66, 595-596. [all data]
Rogers and Choudhury, 1978
Rogers, D.W.; Choudhury, D.N.,
Heats of hydrogenation of large molecules. Part 3 - Five simple unsaturated triglycerides (triacylglycerols),
J. Chem. Soc. Faraday Trans. 1, 1978, 74, 2868-2872. [all data]