Benzenemethanol, α-methyl-, (S)-
- Formula: C8H10O
- Molecular weight: 122.1644
- IUPAC Standard InChIKey: WAPNOHKVXSQRPX-SSDOTTSWSA-N
- CAS Registry Number: 1445-91-6
- Chemical structure:
View 3d structure (requires JavaScript / HTML 5) - Stereoisomers:
- Other names: Benzenemethanol, α-methyl-, (αS)-

Phase change data

Data compiled by: Robert L. Brown and Stephen E. Stein
Reduced pressure boiling point
Tboil (K) | Pressure (bar) | Reference |
---|---|---|
371.2 | 0.027 | Aldrich Chemical Company Inc., 1990 |

References

Aldrich Chemical Company Inc., 1990
Aldrich Chemical Company Inc.,
Catalog Handbook of Fine Chemicals, Aldrich Chemical Company, Inc., Milwaukee WI, 1990, 1. [all data]