Nitrosyl ion
- Formula: NO+
- Molecular weight: 30.0056
- IUPAC Standard InChIKey: KEJOCWOXCDWNID-UHFFFAOYSA-N
- CAS Registry Number: 14452-93-8
- Chemical structure:
View 3d structure (requires JavaScript / HTML 5) - Other names: NO+; Nitrogen oxide cation

Gas phase thermochemistry data

Quantity | Value | Units | Method | Reference | Comment |
---|---|---|---|---|---|
S°gas,1 bar | 198.22 | J/mol*K | Review | Chase, 1998 | Data last reviewed in June, 1966 |

Constants of diatomic molecules

Data compiled by: Klaus P. Huber and Gerhard H. Herzberg
Data collected through March, 1977
Symbol | Meaning |
---|---|
State | electronic state and / or symmetry symbol |
Te | minimum electronic energy (cm-1) |
ωe | vibrational constant – first term (cm-1) |
ωexe | vibrational constant – second term (cm-1) |
ωeye | vibrational constant – third term (cm-1) |
Be | rotational constant in equilibrium position (cm-1) |
αe | rotational constant – first term (cm-1) |
γe | rotation-vibration interaction constant (cm-1) |
De | centrifugal distortion constant (cm-1) |
βe | rotational constant – first term, centrifugal force (cm-1) |
re | internuclear distance (Å) |
Trans. | observed transition(s) corresponding to electronic state |
ν00 | position of 0-0 band (units noted in table) |
State | Te | ωe | ωexe | ωeye | Be | αe | γe | De | βe | re | Trans. | ν00 |
---|---|---|---|---|---|---|---|---|---|---|---|---|
1Π | 534.4 eV 1 | |||||||||||
↳Siegbahn, Nordling, et al., 1969; Davis and Shirley, 1972 | ||||||||||||
3Π | 533.9 eV 1 | |||||||||||
↳Siegbahn, Nordling, et al., 1969; Davis and Shirley, 1972 | ||||||||||||
1Π | 402.3 eV 2 | |||||||||||
↳Siegbahn, Nordling, et al., 1969; Davis and Shirley, 1972 | ||||||||||||
3Π | 400.9 eV 2 | |||||||||||
↳Siegbahn, Nordling, et al., 1969; Davis and Shirley, 1972 | ||||||||||||
State | Te | ωe | ωexe | ωeye | Be | αe | γe | De | βe | re | Trans. | ν00 |
1Π | 34.5 eV 3 | |||||||||||
↳Siegbahn, Nordling, et al., 1969; Davis and Shirley, 1972 | ||||||||||||
3Π | 31.3 eV 3 | |||||||||||
↳Siegbahn, Nordling, et al., 1969; Davis and Shirley, 1972 | ||||||||||||
(B' 1Σ+) | (109400) 4 | (730) 4 | 7 | |||||||||
c 3Π | (100780) 5 | (1900) | ||||||||||
A 1Π | 73471.72 6 | 1601.93 Z | 20.207 | -0.2683 | 1.5860 7 | 0.0245 | [5.6E-6] | 1.1931 | A → X 8 9 R | 73083.46 Z | ||
↳Baer and Miescher, 1953; Tanaka, 1953; missing citation; Field, 1973; Alberti and Douglas, 1975 | ||||||||||||
State | Te | ωe | ωexe | ωeye | Be | αe | γe | De | βe | re | Trans. | ν00 |
W 1Δ | 71450 | 1278 10 | 16.0 11 | (1.361) 12 | (0.0192) | (1.288) | ||||||
A' 1Σ+ | 69540 | 1283 10 | 13.5 11 | (1.363) 12 | (0.0192) | (1.287) | ||||||
b' 3Σ- | 67720 | 1284 10 | 10.7 11 | 1.357 13 | (0.0192) | 1.290 | b' → X 14 | |||||
↳Maier and Holland, 1971; Field, 1973 | ||||||||||||
w 3Δ | 61880 | 1313 10 | 10.6 11 | (1.377) 12 | (0.0192) | (1.280) | ||||||
b 3Πp | 59240 | 1710 | (14) 12 11 | (1.634) 12 | (0.0184) 12 | (1.175) | b → X | 58900 | ||||
↳Maier and Holland, 1971 | ||||||||||||
State | Te | ωe | ωexe | ωeye | Be | αe | γe | De | βe | re | Trans. | ν00 |
a 3Σ+ | 52190 | 1293 10 | 15.1 11 | (1.369) 12 | (0.0192) | (1.284) | ||||||
Neither photoelectron spectra Turner and May, 1966, Price, 1968, Samson, 1968 nor charge exchange experiments Sjogren and Szabo, 1968 have confirmed the existence of a previously predicted Tanaka, 1942, Huber, 1961 electronic state of NO+ at 39960 cm-1 above 1Σ+. See Huber, 1968. | ||||||||||||
X 1Σ+ | 0 | 2376.42 Z | 16.262 11 | 1.99727 15 | 0.01889 | 5.64E-6 | 1.06322 16 | |||||
↳Stair and Gauvin, 1967 |

References

Chase, 1998
Chase, M.W., Jr.,
NIST-JANAF Themochemical Tables, Fourth Edition,
J. Phys. Chem. Ref. Data, Monograph 9, 1998, 1-1951. [all data]