Lead hydride
- Formula: HPb
- Molecular weight: 208.2
- CAS Registry Number: 14452-81-4

Gas phase thermochemistry data

Quantity | Value | Units | Method | Reference | Comment |
---|---|---|---|---|---|
ΔfH°gas | 56.451 | kcal/mol | Review | Chase, 1998 | Data last reviewed in June, 1962 |
Quantity | Value | Units | Method | Reference | Comment |
S°gas,1 bar | 52.763 | cal/mol*K | Review | Chase, 1998 | Data last reviewed in June, 1962 |
Gas Phase Heat Capacity (Shomate Equation)
Cp° = A + B*t + C*t2 + D*t3 +
E/t2
H° − H°298.15= A*t + B*t2/2 +
C*t3/3 + D*t4/4 − E/t + F − H
S° = A*ln(t) + B*t + C*t2/2 + D*t3/3 −
E/(2*t2) + G
Cp = heat capacity (cal/mol*K)
H° = standard enthalpy (kcal/mol)
S° = standard entropy (cal/mol*K)
t = temperature (K) / 1000.
View plot Requires a JavaScript / HTML 5 canvas capable browser.
Temperature (K) | 298. to 1000. | 1000. to 6000. |
---|---|---|
A | 4.870741 | 7.031000 |
B | 6.657642 | 1.454160 |
C | -3.934690 | -0.183427 |
D | 0.820152 | 0.007319 |
E | 0.046070 | 0.183914 |
F | 54.88979 | 54.42390 |
G | 57.09849 | 60.76840 |
H | 56.45010 | 56.45010 |
Reference | Chase, 1998 | Chase, 1998 |
Comment | Data last reviewed in June, 1962 | Data last reviewed in June, 1962 |

Reaction thermochemistry data

Data compiled by: John E. Bartmess
Individual Reactions
Pb- + = HPb
Quantity | Value | Units | Method | Reference | Comment |
---|---|---|---|---|---|
ΔrH° | 347.5 ± 2.0 | kcal/mol | D-EA | Feigerle, Corderman, et al., 1981 | gas phase |

Gas phase ion energetics data

Data compiled by: John E. Bartmess
De-protonation reactions
Pb- + = HPb
Quantity | Value | Units | Method | Reference | Comment |
---|---|---|---|---|---|
ΔrH° | 347.5 ± 2.0 | kcal/mol | D-EA | Feigerle, Corderman, et al., 1981 | gas phase |

Constants of diatomic molecules

Data compiled by: Klaus P. Huber and Gerhard H. Herzberg

Data collected through May, 1977

Symbols used in the table of constants
SymbolMeaning
State electronic state and / or symmetry symbol
Te minimum electronic energy (cm-1)
ωe vibrational constant – first term (cm-1)
ωexe vibrational constant – second term (cm-1)
ωeye vibrational constant – third term (cm-1)
Be rotational constant in equilibrium position (cm-1)
αe rotational constant – first term (cm-1)
γe rotation-vibration interaction constant (cm-1)
De centrifugal distortion constant (cm-1)
βe rotational constant – first term, centrifugal force (cm-1)
re internuclear distance (Å)
Trans. observed transition(s) corresponding to electronic state
ν00 position of 0-0 band (units noted in table)
Diatomic constants for (208)PbH
StateTeωeωexeωeyeBeαeγeDeβereTrans.ν00
C (2Δ) 1           C → X 26205
Watson and Simon, 1940; Kleman, 1953
B (18030) 2 [478.8] 3 Z   [2.478] 3 4     [2.604] B → X R 17498.7 3 Z
Watson, 1938; Watson and Simon, 1940
A (17590) (500) 5 (10) 5  (3.025) 5 (0.05) 5    (2.36) (A-X) (17060) 5
X (2Π1/2) 0 6 1564.1 Z 29.75  4.971 0.144  [201E-6]  1.8388

References

Chase, 1998
Chase, M.W., Jr.,
NIST-JANAF Themochemical Tables, Fourth Edition,
J. Phys. Chem. Ref. Data, Monograph 9, 1998, 1-1951. [all data]
Feigerle, Corderman, et al., 1981
Feigerle, C.S.; Corderman, R.R.; Lineberger, W.C.,
Electron affinities of B, Al, Bi, and Pb,
J. Chem. Phys., 1981, 74, 2, 1513, https://doi.org/10.1063/1.441174
. [all data]