Boron dihydride

Reaction thermochemistry data

Data compiled by: John E. Bartmess

Individual Reactions

HB- + Hydrogen cation = H2B

By formula: HB- + H+ = H2B

Quantity Value Units Method Reference Comment
Δr1629. ± 28.kJ/molD-EAReid, 1993gas phase

References

Reid, 1993
Reid, C.J., Electron Affinities of BH, B2, BC, and BN molecules determined using Charge Inversion Spectrometry, Int. J. Mass Spectrom. Ion Proc., 1993, 127, 147, https://doi.org/10.1016/0168-1176(93)87087-9 . [all data]