Boron
- Formula: B2
- Molecular weight: 21.622
- IUPAC Standard InChIKey: ZOCHARZZJNPSEU-UHFFFAOYSA-N
- CAS Registry Number: 14452-61-0
- Chemical structure:
View 3d structure (requires JavaScript / HTML 5) - Permanent link for this species. Use this link for bookmarking this species for future reference.

Gas phase thermochemistry data

Quantity | Value | Units | Method | Reference | Comment |
---|---|---|---|---|---|
ΔfH°gas | 829.69 | kJ/mol | Review | Chase, 1998 | Data last reviewed in March, 1979 |
Quantity | Value | Units | Method | Reference | Comment |
S°gas,1 bar | 202.07 | J/mol*K | Review | Chase, 1998 | Data last reviewed in March, 1979 |
Gas Phase Heat Capacity (Shomate Equation)
Cp° = A + B*t + C*t2 + D*t3 +
E/t2
H° − H°298.15= A*t + B*t2/2 +
C*t3/3 + D*t4/4 − E/t + F − H
S° = A*ln(t) + B*t + C*t2/2 + D*t3/3 −
E/(2*t2) + G
Cp = heat capacity (J/mol*K)
H° = standard enthalpy (kJ/mol)
S° = standard entropy (J/mol*K)
t = temperature (K) / 1000.
View plot Requires a JavaScript / HTML 5 canvas capable browser.
Temperature (K) | 298. to 800. | 800. to 6000. |
---|---|---|
A | -5.565682 | 43.33243 |
B | 150.5307 | -3.618461 |
C | -170.6670 | 0.949371 |
D | 66.18586 | -0.067489 |
E | 0.506419 | -0.352579 |
F | 827.7333 | 814.3738 |
G | 160.3058 | 250.2693 |
H | 829.6872 | 829.6872 |
Reference | Chase, 1998 | Chase, 1998 |
Comment | Data last reviewed in March, 1979 | Data last reviewed in March, 1979 |

Gas phase ion energetics data

Data compiled by: John E. Bartmess
Electron affinity determinations
EA (eV) | Reference | Comment |
---|---|---|
>1.30 ± 0.40 | Reid, 1993 | EA "probably 41.5 kcal/mol. |

Constants of diatomic molecules

Data compiled by: Klaus P. Huber and Gerhard H. Herzberg
Data collected through September, 1976
Symbol | Meaning |
---|---|
State | electronic state and / or symmetry symbol |
Te | minimum electronic energy (cm-1) |
ωe | vibrational constant – first term (cm-1) |
ωexe | vibrational constant – second term (cm-1) |
ωeye | vibrational constant – third term (cm-1) |
Be | rotational constant in equilibrium position (cm-1) |
αe | rotational constant – first term (cm-1) |
γe | rotation-vibration interaction constant (cm-1) |
De | centrifugal distortion constant (cm-1) |
βe | rotational constant – first term, centrifugal force (cm-1) |
re | internuclear distance (Å) |
Trans. | observed transition(s) corresponding to electronic state |
ν00 | position of 0-0 band (units noted in table) |
State | Te | ωe | ωexe | ωeye | Be | αe | γe | De | βe | re | Trans. | ν00 |
---|---|---|---|---|---|---|---|---|---|---|---|---|
A 3Σu- | 30573.4 | 937.4 Z | 2.6 | 1.160 | 0.011 | 1.625 | A ↔ X R | 30518.10 Z | ||||
↳missing citation; Nicholls, Fraser, et al., 1959; Graham and Weltner, 1976 | ||||||||||||
X 3Σg- | 0 | 1051.3 Z | 9.35 | 1.212 | 0.014 | 1.590 |

References

Chase, 1998
Chase, M.W., Jr.,
NIST-JANAF Themochemical Tables, Fourth Edition,
J. Phys. Chem. Ref. Data, Monograph 9, 1998, 1-1951. [all data]
Reid, 1993
Reid, C.J.,
Electron Affinities of BH, B2, BC, and BN molecules determined using Charge Inversion Spectrometry,
Int. J. Mass Spectrom. Ion Proc., 1993, 127, 147, https://doi.org/10.1016/0168-1176(93)87087-9
. [all data]
Nicholls, Fraser, et al., 1959
Nicholls, R.W.; Fraser, P.A.; Jarmain, W.R.,
Transition probability parameters of molecular spectra arising from combustion processes,
Combust. Flame, 1959, 3, 13. [all data]
Graham and Weltner, 1976
Graham; Weltner,
Private communication cited in Huber and Herzberg, 1979, 1976, 65. [all data]
Verhaegen and Drowart, 1962
Verhaegen, G.; Drowart, J.,
Mass spectrometric determination of the heat of sublimation of boron and of the dissociation energy of B2,
J. Chem. Phys., 1962, 37, 1367. [all data]
Stull and Prophet, 1971
Stull, D.R.; Prophet, H.,
JANAF Thermochemical Tables. Second Edition, Office of SRD (NSRDS-NBS 37), Washington, D.C., 1971, 0. [all data]
Bender and Davidson, 1967
Bender, C.F.; Davidson, E.R.,
Electronic structure of the B2 molecule,
J. Chem. Phys., 1967, 46, 3313. [all data]
Huber and Herzberg, 1979
Huber, K.P.; Herzberg, G.,
Molecular Spectra and Molecular Structure. IV. Constants of Diatomic Molecules, Van Nostrand Reinhold Company, New York, 1979, 716. [all data]