n-Propyl cyanoacetate
- Formula: C6H9NO2
- Molecular weight: 127.1412
- IUPAC Standard InChIKey: NLFIMXLLXGTDME-UHFFFAOYSA-N
- CAS Registry Number: 14447-15-5
- Chemical structure:
View 3d structure (requires JavaScript / HTML 5) - Other names: Acetic acid, cyano-, propyl ester; propyl cyanoacetate

Condensed phase thermochemistry data

Data compiled by: Hussein Y. Afeefy, Joel F. Liebman, and Stephen E. Stein
Quantity | Value | Units | Method | Reference | Comment |
---|---|---|---|---|---|
ΔfH°liquid | -343. | kJ/mol | Ccb | Guinchant, 1918 | Author hf288_condensed[kcal/mol]=-87.2 kcal/mol |
Quantity | Value | Units | Method | Reference | Comment |
ΔcH°liquid | -3304. | kJ/mol | Ccb | Guinchant, 1918 | Author hf288_condensed[kcal/mol]=-87.2 kcal/mol |

References

Guinchant, 1918
Guinchant, M.J.,
Etude sur la fonction acide dans les derives metheniques et methiniques,
Ann. Chem., 1918, 10, 30-84. [all data]