1-(2-Propenyl)piperidine
- Formula: C8H15N
- Molecular weight: 125.2114
- IUPAC Standard InChIKey: KYGMSGYKSGNPHM-UHFFFAOYSA-N
- CAS Registry Number: 14446-67-4
- Chemical structure:
View 3d structure (requires JavaScript / HTML 5) - Other names: Piperidine, 1-(2-propenyl)-; N-Allylpiperidine

Condensed phase thermochemistry data

Data compiled by: Hussein Y. Afeefy, Joel F. Liebman, and Stephen E. Stein
Quantity | Value | Units | Method | Reference | Comment |
---|---|---|---|---|---|
ΔfH°liquid | -36.4 ± 1.1 | kJ/mol | Ccb | Prochazka, Krestanova, et al., 1970 | |
Quantity | Value | Units | Method | Reference | Comment |
ΔcH°liquid | -5255.4 ± 1.0 | kJ/mol | Ccb | Prochazka, Krestanova, et al., 1970 |

Kovats' RI, non-polar column, isothermal

Column type | Active phase | Temperature (C) | I | Reference | Comment |
---|---|---|---|---|---|
Capillary | OV-101 | 110. | 931. | Zhuravleva, 2000 | 50. m/0.3 mm/0.4 μm, He |

References

Prochazka, Krestanova, et al., 1970
Prochazka, M.; Krestanova, V.; Palecek, M.; Pecka, K.,
The heats of formation of some enamines,
Collect. Czech. Chem. Commun., 1970, 35, 3813-3817. [all data]
Zhuravleva, 2000
Zhuravleva, I.L.,
Evaluation of the polarity and boiling points of nitrogen-containing heterocyclic compounds by gas chromatography,
Russ. Chem. Bull. (Engl. Transl.), 2000, 49, 2, 325-328, https://doi.org/10.1007/BF02494682
. [all data]