Phosphorocyanidic diamide, tetramethyl-
- Formula: C5H12N3OP
- Molecular weight: 161.1420
- IUPAC Standard InChIKey: JNTCYEJCTUGHJO-UHFFFAOYSA-N
- CAS Registry Number: 14445-60-4
- Chemical structure:
View 3d structure (requires JavaScript / HTML 5) - Other names: Phosphoric acid, nitrile-, N,N,N',N'-tetramethyldiamide; N,N,N',N'-Tetramethylphosphorodiamidic cyanide; bis-(N,N-Dimethyl)phosphoramidocyanidate; Tetramethylphosphorodiamidic cyanide

Van Den Dool and Kratz RI, non-polar column, temperature ramp

Column type | Active phase | I | Reference | Comment |
---|---|---|---|---|
Capillary | OV-1 | 1180. | Kostiainen, 2000 | 15. m/0.32 mm/0.25 μm, He, 50. C @ 2. min, 10. K/min, 280. C @ 10. min |
Capillary | SE-54 | 1245.7 | Kostiainen, 2000 | 25. m/0.32 mm/0.25 μm, He, 40. C @ 1. min, 10. K/min, 280. C @ 10. min |

Normal alkane RI, non-polar column, temperature ramp

Column type | Active phase | I | Reference | Comment |
---|---|---|---|---|
Capillary | DB-1 | 1179.5 | D'Agostino, Hansen, et al., 1985 | 15. m/0.32 mm/0.25 μm, He, 50. C @ 2. min, 10. K/min; Tend: 300. C |
Capillary | DB-5 | 1245.7 | D'Agostino, Hansen, et al., 1985 | 15. m/0.32 mm/0.25 μm, He, 50. C @ 2. min, 10. K/min; Tend: 300. C |

References

Kostiainen, 2000
Kostiainen, O.,
Gas Chromatography in Screening of Chemicals Related to the Chemical Weapons Convention
in Encyclopedia of Analytical Chemistry, Meyers, R.A., ed(s)., John Wiley Sons Ltd, Chichester, 2000, 963-979. [all data]
D'Agostino, Hansen, et al., 1985
D'Agostino, P.A.; Hansen, A.S.; Lockwood, P.A.; Provost, L.R.,
Capillary Column Gas Chromatography-Mass Spectrometry of Tabun,
J. Chromatogr., 1985, 347, 257-266, https://doi.org/10.1016/S0021-9673(01)95491-3
. [all data]