1-Heptadecanol, TMS derivative
- Formula: C20H44OSi
- Molecular weight: 328.6483
- IUPAC Standard InChIKey: DQOJNDFXOIYCNC-UHFFFAOYSA-N
- CAS Registry Number: 144363-02-0
- Chemical structure:
View 3d structure (requires JavaScript / HTML 5) - Other names: Silane, (heptadecyloxy)trimethyl-; 1-Trimethylsilyloxyheptadecane; Heptadecoxy-trimethylsilane; Heptadecane, , 1-trimethylsilyloxy-; (Heptadecyloxy)trimethylsilane; 1-Heptadecanol, trimethylsilyl ether; 1-Heptadecanol, O-TMS; Heptadecan-1-ol trimethylsilyl ether; 1-Heptadecyl trimethylsilyl ether; Heptadecyloxytrimethylsilyl ether

Van Den Dool and Kratz RI, non-polar column, temperature ramp

Column type | Active phase | I | Reference | Comment |
---|---|---|---|---|
Capillary | DB-1 | 2056. | Peng, 1992 | 15. m/0.53 mm/1. μm, 40. C @ 4. min, 8. K/min; Tend: 250. C |

Van Den Dool and Kratz RI, non-polar column, custom temperature program

Column type | Active phase | I | Reference | Comment |
---|---|---|---|---|
Capillary | VF-5MS | 2054. | Tret'yakov, 2008 | 30. m/0.25 mm/0.25 μm, He; Program: Multi-step temperature program; T(initial)=60C; T(final)=270C |
Capillary | VF-5MS | 2053.9 | Zheng and White, 2008 | 30. m/0.25 mm/0.25 μm, He; Program: not specified |

Van Den Dool and Kratz RI, polar column, temperature ramp

Column type | Active phase | I | Reference | Comment |
---|---|---|---|---|
Capillary | Carbowax 20M | 2046. | Peng, 1992 | 8. K/min, 200. C @ 60. min; Column length: 3.05 m; Tstart: 40. C |

References

Peng, 1992
Peng, C.T.,
A method for tentative identificatoin of unknown gas chromatographic peaks by retention index,
J. Radioanal. Nucl. Chem., 1992, 160, 2, 449-460, https://doi.org/10.1007/BF02037120
. [all data]
Tret'yakov, 2008
Tret'yakov, K.V.,
Retention Data. NIST Mass Spectrometry Data Center., NIST Mass Spectrometry Data Center, 2008. [all data]
Zheng and White, 2008
Zheng, Y.; White, E.,
Retention Data. NIST Mass Spectrometry Data Center., NIST Mass Spectrometry Data Center, 2008. [all data]