2,7-Octadien-4-ol, 2-methyl-6-methylene-
- Formula: C10H16O
- Molecular weight: 152.2334
- IUPAC Standard InChIKey: NHMKYUHMPXBMFI-UHFFFAOYSA-N
- CAS Registry Number: 14434-41-4
- Chemical structure:
View 3d structure (requires JavaScript / HTML 5) - Species with the same structure:
- Other names: 2-Methyl-6-methylene-2,7-octadien-4-ol; (.+/-.)-Ipsdienol; 2-methyl-6-methyleneocta-2,7-dien-4-ol

Van Den Dool and Kratz RI, non-polar column, custom temperature program

Column type | Active phase | I | Reference | Comment |
---|---|---|---|---|
Capillary | HP-5MS | 1150.2 | Andriamaharavo, 2014 | 30. m/0.25 mm/0.25 μm, He; Program: 60C (1 min) => 5 C/min => 210C => 10 C/min => 280C (15 min) |
Capillary | DB-1 | 1147. | Rouseff, Smoot, et al., 2002 | Program: not specified |

References

Andriamaharavo, 2014
Andriamaharavo, N.R.,
Retention Data. NIST Mass Spectrometry Data Center., NIST Mass Spectrometry Data Center, 2014. [all data]
Rouseff, Smoot, et al., 2002
Rouseff, R.; Smoot, J.; Valim, F.; Dreher, G.; Mahattanatawee, k.; Bell, W.; Blaze, M.,
Flavor Database, 2002, retrieved from http://www.lal.ufl.edu/rouseff. [all data]