N,N-Dimethyldecanamide
- Formula: C12H25NO
- Molecular weight: 199.3330
- IUPAC Standard InChIKey: HNXNKTMIVROLTK-UHFFFAOYSA-N
- CAS Registry Number: 14433-76-2
- Chemical structure:
View 3d structure (requires JavaScript / HTML 5) - Other names: Decanamide, N,N-dimethyl-; N,N-Dimethylcapramide; N,N-Dimethylcapylamide; N,N-Dimethyldecanoamide; N,N-dimethyldecan-1-amide

Phase change data

Data compiled by: Robert L. Brown and Stephen E. Stein
Reduced pressure boiling point
Tboil (K) | Pressure (bar) | Reference |
---|---|---|
383. to 384. | 0.0007 | Frinton Laboratories Inc., 1986 |

References

Frinton Laboratories Inc., 1986
Frinton Laboratories Inc.,
Catalog Number 11, Frinton Laboratories Inc., Vineland, NJ, 1986, 99. [all data]