Benzenesulfonamide, N,N-dimethyl-
- Formula: C8H11NO2S
- Molecular weight: 185.243
- IUPAC Standard InChIKey: BVSPJPNNLDIUFE-UHFFFAOYSA-N
- CAS Registry Number: 14417-01-7
- Chemical structure:
View 3d structure (requires JavaScript / HTML 5) - Other names: Benzenesulfonic dimethylamide; N,N-Dimethylbenzenesulfonamide; N,N-dimethylbenzenesulphamide

Van Den Dool and Kratz RI, non-polar column, temperature ramp

Column type | Active phase | I | Reference | Comment |
---|---|---|---|---|
Capillary | VF-5MS | 1548. | Todua, 2011 | 30. m/0.25 mm/0.25 μm, He; Tstart: 60. C; Tend: 270. C |
Capillary | DB-1 | 1595. | Johnson, Urso, et al., 1997 | 30. m/0.2 mm/0.25 μm, 50. C @ 2. min, 5. K/min, 300. C @ 5. min |

Lee's RI, non-polar column, temperature ramp

Column type | Active phase | I | Reference | Comment |
---|---|---|---|---|
Capillary | DB-1 | 280.4 | Johnson, Urso, et al., 1997 | 30. m/0.2 mm/0.25 μm, 50. C @ 2. min, 5. K/min, 300. C @ 5. min |

References

Todua, 2011
Todua, N.G.,
Retention Data. NIST Mass Spectrometry Data Center., NIST Mass Spectrometry Data Center, 2011. [all data]
Johnson, Urso, et al., 1997
Johnson, C.I.; Urso, A.; Geleta, L.,
Broad spectrum analysis of municipal and industrial effluents discharged into the Peace, Athabasca and Slave river basins: characterization of effluent samples, 1994 - Volume 1 of 2, Northern River Basins Study Project Report No. 121, Norther River Basins Study, Edmonton, Alberta, 1997, 27. [all data]