Pentachlorophenyl acetate
- Formula: C8H3Cl5O2
- Molecular weight: 308.373
- IUPAC Standard InChIKey: RRYATXLRCBOQTJ-UHFFFAOYSA-N
- CAS Registry Number: 1441-02-7
- Chemical structure:
View 3d structure (requires JavaScript / HTML 5) - Other names: Phenol, pentachloro-, acetate; Rabcon; CPA; Pentachlorophenol, O-acetyl-; 2,3,4,5,6-Pentachlorophenyl acetate

Kovats' RI, non-polar column, isothermal

Column type | Active phase | Temperature (C) | I | Reference | Comment |
---|---|---|---|---|---|
Capillary | SE-30 | 160. | 1800. | Evans and Haken, 1989 | Column length: 25. m; Column diameter: 0.32 mm |
Capillary | OV-101 | 160. | 1808. | Haken and Korhonen, 1983 | N2; Column length: 25. m; Column diameter: 0.22 mm |
Capillary | OV-101 | 180. | 1809. | Haken and Korhonen, 1983 | N2; Column length: 25. m; Column diameter: 0.22 mm |

Kovats' RI, polar column, isothermal

Column type | Active phase | Temperature (C) | I | Reference | Comment |
---|---|---|---|---|---|
Capillary | OV-351 | 160. | 2401. | Evans and Haken, 1989 | Column length: 25. m; Column diameter: 0.32 mm |

Van Den Dool and Kratz RI, non-polar column, temperature ramp

Column type | Active phase | I | Reference | Comment |
---|---|---|---|---|
Capillary | VF-5MS | 1844. | Todua, 2011 | 30. m/0.25 mm/0.25 μm, He; Tstart: 60. C; Tend: 270. C |
Capillary | ZB-1 | 1808. | Urbanczyk, Staniewski, et al., 2002 | 30. m/0.25 mm/0.50 μm, He, 50. C @ 3. min, 10. K/min, 280. C @ 10. min |

References

Evans and Haken, 1989
Evans, M.B.; Haken, J.K.,
Dispersion and selectivity indices in gas chromatography. IV. Chlorinated aromatic compounds,
J. Chromatogr., 1989, 468, 373-382, https://doi.org/10.1016/S0021-9673(00)96332-5
. [all data]
Haken and Korhonen, 1983
Haken, J.K.; Korhonen, I.O.O.,
Gas chromatography of homologous esters. XXI. Capillary column studies of the chlorinated phenyl acetates,
J. Chromatogr., 1983, 257, 267-273, https://doi.org/10.1016/S0021-9673(01)88182-6
. [all data]
Todua, 2011
Todua, N.G.,
Retention Data. NIST Mass Spectrometry Data Center., NIST Mass Spectrometry Data Center, 2011. [all data]
Urbanczyk, Staniewski, et al., 2002
Urbanczyk, A.; Staniewski, J.; Szymanowski, J.,
Abraham model in gas chromatography of phenol pollutants,
Anal. Chim. Acta., 2002, 466, 1, 151-159, https://doi.org/10.1016/S0003-2670(02)00544-5
. [all data]