tris(pentane-2,4-dionato-O,O')gallium
- Formula: C15H21GaO6
- Molecular weight: 367.047
- CAS Registry Number: 14405-43-7

Condensed phase thermochemistry data

Data compiled by: José A. Martinho Simões
Quantity | Value | Units | Method | Reference | Comment |
---|---|---|---|---|---|
ΔfH°solid | -1478.2 ± 3.7 | kJ/mol | Review | Martinho Simões | Selected data. The enthalpy of formation is the average of the results obtained by CC-SB Cavell and Pilcher, 1977 and RSC Irving and Walter, 1969. |

Phase change data

Data compiled by: William E. Acree, Jr., James S. Chickos
Enthalpy of sublimation
ΔsubH (kJ/mol) | Temperature (K) | Method | Reference |
---|---|---|---|
90.0 | 413. to 433. | TGA | Fahlman and Barron, 2000 |

Gas phase thermochemistry data

Data compiled by: José A. Martinho Simões
Quantity | Value | Units | Method | Reference | Comment |
---|---|---|---|---|---|
ΔfH°gas | -1356. ± 11. | kJ/mol | Review | Martinho Simões | Selected data. The enthalpy of formation is the average of the results obtained by CC-SB Cavell and Pilcher, 1977 and RSC Irving and Walter, 1969. |

References

Martinho Simões
Martinho Simões, J.A.,
Private communication (see http://webbook.nist.gov/chemistry/om/). [all data]
Cavell and Pilcher, 1977
Cavell, K.J.; Pilcher, G.,
J. Chem. Soc. Faraday Trans. I, 1977, 73, 1590. [all data]
Irving and Walter, 1969
Irving, R.J.; Walter, G.W.,
J. Chem. Soc. (A), 1969, 2690.. [all data]
Fahlman and Barron, 2000
Fahlman, Bradley D.; Barron, Andrew R.,
Substituent effects on the volatility of metal ?-diketonates,
Adv. Mater. Opt. Electron., 2000, 10, 3-5, 223-232, https://doi.org/10.1002/1099-0712(200005/10)10:3/5<223::AID-AMO411>3.0.CO;2-M
. [all data]