tris(1-phenyl-1,3-butanedionato)aluminum(III)

Phase change data

Data compiled by: William E. Acree, Jr., James S. Chickos

Quantity Value Units Method Reference Comment
Δsub195.2 ± 2.1kJ/molN/ARibeiro da Silva, Monte, et al., 1995
Δsub193.7 ± 0.3kJ/molN/ARibeiro Da Silva and Reis, 1983

Enthalpy of sublimation

ΔsubH (kJ/mol) Temperature (K) Method Reference Comment
186.8 ± 2.1470.ME,TERibeiro da Silva, Monte, et al., 1995Based on data from 462. - 478. K.

References

Ribeiro da Silva, Monte, et al., 1995
Ribeiro da Silva, Manuel A.V.; Monte, Manuel J.S.; Huinink, Jan, Vapour pressures and standard molar enthalpies of sublimation of beryllium(II) and aluminium(III) benzoylacetonates, Journal of Alloys and Compounds, 1995, 224, 2, 181-183, https://doi.org/10.1016/0925-8388(95)01562-0 . [all data]

Ribeiro Da Silva and Reis, 1983
Ribeiro Da Silva, Manuel A.V.; Reis, Ana Maria M.V., The standard molar enthalpies of formation of bis(benzoylacetonato)-beryllium(II) and tris(benzoylacetonato)-aluminium(III) and the mean molar metal-oxygen bond-dissociation enthalpies, The Journal of Chemical Thermodynamics, 1983, 15, 10, 957-963, https://doi.org/10.1016/0021-9614(83)90129-5 . [all data]