1-Phenyl-1-heptyne
- Formula: C13H16
- Molecular weight: 172.2661
- IUPAC Standard InChIKey: MDKGOJZZRHBMQU-UHFFFAOYSA-N
- CAS Registry Number: 14374-45-9
- Chemical structure:
View 3d structure (requires JavaScript / HTML 5) - Other names: Benzene, 1-heptynyl-; 1-heptynylbenzene

Phase change data

Data compiled by: Robert L. Brown and Stephen E. Stein
Reduced pressure boiling point
Tboil (K) | Pressure (bar) | Reference |
---|---|---|
399. to 400. | 0.020 | Farchan Laboratories, 1990 |

References

Farchan Laboratories, 1990
Farchan Laboratories,
Research Chemicals Catalog, Farchan Laboratories, Gainesville, FL, 1990, 91. [all data]