Cinnamaldehyde, (E)-
- Formula: C9H8O
- Molecular weight: 132.1592
- IUPAC Standard InChIKey: KJPRLNWUNMBNBZ-QPJJXVBHSA-N
- CAS Registry Number: 14371-10-9
- Chemical structure:
View 3d structure (requires JavaScript / HTML 5) - Stereoisomers:
- Other names: (E)-Cinnamaldehyde; trans-Cinnamaldehyde; trans-Cinnamic aldehyde; trans-Cinnamylaldehyde; (E)-3-Phenylpropenal; 2-Propenal, 3-phenyl-, (E)-; (2E)-3-Phenyl-2-propenal; (E)-Cinnamic aldehyde; 2-Propenal, 3-phenyl-, (2E)-; Cinnamaldehyde

Phase change data

Data compiled by: Robert L. Brown and Stephen E. Stein
Quantity | Value | Units | Method | Reference | Comment |
---|---|---|---|---|---|
Tboil | 521.2 | K | N/A | Aldrich Chemical Company Inc., 1990 |

Kovats' RI, polar column, temperature ramp

Data compiled by: NIST Mass Spectrometry Data Center, William E. Wallace, director

Column type Capillary
Active phase Supelcowax-10
Column length (m) 60.
Carrier gas He
Substrate
Column diameter (mm) 0.25
Phase thickness (μm)
Tstart (C) 35.
Tend (C) 200.
Heat rate (K/min) 3.
Initial hold (min) 5.
Final hold (min) 20.
I 2043.
ReferenceWong and Teng, 1994
Comment MSDC-RI

References

Aldrich Chemical Company Inc., 1990
Aldrich Chemical Company Inc.,
Catalog Handbook of Fine Chemicals, Aldrich Chemical Company, Inc., Milwaukee WI, 1990, 1. [all data]