cis-1,2-Cyclohexanediamine
- Formula: C6H14N2
- Molecular weight: 114.1888
- IUPAC Standard InChIKey: SSJXIUAHEKJCMH-OLQVQODUSA-N
- CAS Registry Number: 1436-59-5
- Chemical structure:
View 3d structure (requires JavaScript / HTML 5) - Stereoisomers:
- Other names: cis-1,2-Cyclohexandiamine; 1,2-Cyclohexanediamine, cis-; cis-1,2-Diaminocyclohexane; meso-1,2-Cyclohexanediamine; (R)(S)-1,2-Diaminocyclohexane; 1,2-Cyclohexanediamine, (1R,2S)-rel-

Phase change data

Data compiled as indicated in comments:
BS - Robert L. Brown and Stephen E. Stein
AC - William E. Acree, Jr., James S. Chickos
Quantity | Value | Units | Method | Reference | Comment |
---|---|---|---|---|---|
ΔvapH° | 62.2 ± 1.0 | kJ/mol | ME | Tomé, Rosado, et al., 2007 | AC |
Reduced pressure boiling point
Tboil (K) | Pressure (bar) | Reference | Comment |
---|---|---|---|
365.7 | 0.024 | Aldrich Chemical Company Inc., 1990 | BS |

References

Tomé, Rosado, et al., 2007
Tomé, Luciana I.N.; Rosado, Mário T.S.; Nunes, Sandra C.C.; Maria, Teresa M.R.; Canotilho, João; Eusébio, M. Ermelinda S.,
Enthalpy of sublimation/vaporization of trans-cyclohexyl-1,4-diamine and cis-cyclohexyl-1,2-diamine,
The Journal of Chemical Thermodynamics, 2007, 39, 10, 1354-1356, https://doi.org/10.1016/j.jct.2007.06.015
. [all data]
Aldrich Chemical Company Inc., 1990
Aldrich Chemical Company Inc.,
Catalog Handbook of Fine Chemicals, Aldrich Chemical Company, Inc., Milwaukee WI, 1990, 1. [all data]