Oxirane, butyl-
- Formula: C6H12O
- Molecular weight: 100.1589
- IUPAC Standard InChIKey: WHNBDXQTMPYBAT-UHFFFAOYSA-N
- CAS Registry Number: 1436-34-6
- Chemical structure:
View 3d structure (requires JavaScript / HTML 5) - Other names: Hexane, 1,2-epoxy-; Butyloxirane; 1-Hexene epoxide; 1-Hexene oxide; 1,2-Epoxyhexane; 1,2-Hexene oxide; 2-Butyloxirane; Epoxy-n-hexane; NSC 24268

Phase change data

Data compiled as indicated in comments:
BS - Robert L. Brown and Stephen E. Stein
AC - William E. Acree, Jr., James S. Chickos
Quantity | Value | Units | Method | Reference | Comment |
---|---|---|---|---|---|
Tboil | 392.2 | K | N/A | Aldrich Chemical Company Inc., 1990 | BS |
Enthalpy of vaporization
ΔvapH (kJ/mol) | Temperature (K) | Method | Reference | Comment |
---|---|---|---|---|
43.1 | 315. | A | Stephenson and Malanowski, 1987 | Based on data from 300. to 390. K. See also Vojtko, Cihova, et al., 1971 and Boublik, Fried, et al., 1984.; AC |

Normal alkane RI, non-polar column, custom temperature program

Column type | Active phase | I | Reference | Comment |
---|---|---|---|---|
Capillary | Methyl Silicone | 768. | Farkas, Héberger, et al., 2004 | Program: not specified |

References

Aldrich Chemical Company Inc., 1990
Aldrich Chemical Company Inc.,
Catalog Handbook of Fine Chemicals, Aldrich Chemical Company, Inc., Milwaukee WI, 1990, 1. [all data]
Stephenson and Malanowski, 1987
Stephenson, Richard M.; Malanowski, Stanislaw,
Handbook of the Thermodynamics of Organic Compounds, 1987, https://doi.org/10.1007/978-94-009-3173-2
. [all data]
Vojtko, Cihova, et al., 1971
Vojtko, J.; Cihova, M.; Hrusovsky, M.,
Sb. Pr. Chem. Fak. SVST, 1971, Date1969-1970, 179. [all data]
Boublik, Fried, et al., 1984
Boublik, T.; Fried, V.; Hala, E.,
The Vapour Pressures of Pure Substances: Selected Values of the Temperature Dependence of the Vapour Pressures of Some Pure Substances in the Normal and Low Pressure Region, 2nd ed., Elsevier, New York, 1984, 972. [all data]
Farkas, Héberger, et al., 2004
Farkas, O.; Héberger, K.; Zenkevich, I.G.,
Quantitative structure-retention relationships. XIV. Prediction of gas chromatographic retention indices for saturated O-, N-, and S-heterocyclic compounds,
Chemom. Intell. Lab. Syst., 2004, 72, 2, 173-184, https://doi.org/10.1016/j.chemolab.2004.01.012
. [all data]