Benzene, 2-bromo-1,4-dichloro-
- Formula: C6H3BrCl2
- Molecular weight: 225.898
- IUPAC Standard InChIKey: OVXVQBCRONSPDC-UHFFFAOYSA-N
- CAS Registry Number: 1435-50-3
- Chemical structure:
View 3d structure (requires JavaScript / HTML 5) - Other names: 1-Bromo-2,5-dichlorobenzene; 2-Bromo-1,4-dichlorobenzene; Benzene, 1-bromo-2,5-dichloro-

Phase change data

Data compiled by: Robert L. Brown and Stephen E. Stein
Quantity | Value | Units | Method | Reference | Comment |
---|---|---|---|---|---|
Tboil | 508. | K | N/A | Buckingham and Donaghy, 1982 | |
Quantity | Value | Units | Method | Reference | Comment |
Tfus | 308. | K | N/A | Buckingham and Donaghy, 1982 |
Reduced pressure boiling point
Tboil (K) | Pressure (bar) | Reference |
---|---|---|
392. | 0.035 | Buckingham and Donaghy, 1982 |

References

Buckingham and Donaghy, 1982
Buckingham, J.; Donaghy, S.M.,
Dictionary of Organic Compounds: Fifth Edition, Chapman and Hall, New York, 1982, 1. [all data]